program: Orca
programVersion: 5.0.2
elementType: O O O O N C C C C C C C C C C C C C C C C C H H H H H H H H H H H H H H H H H H H
charge: 0
multiplicity: 1
keywords: wb97x-d3
keywords: def2-TZVPP
keywords: def2/J RIJCOSX
keywords: DEFGRID2
keywords: scfconv7
keywords: smallprint printgap noloewdin
keywords: NOSOSCF
formula: C17H19NO4
InChI: InChI=1/C17H19NO4/c1-2-20-17(19)18-12-13-21-14-8-10-16(11-9-14)22-15-6-4-3-5-7-15/h3-11,18H,2,12-13H2,1H3
41 atoms
O  -2.054443 -0.756509 0.883195
O  2.914717 -2.783799 -0.352481
O  -3.76815 3.498175 0.517418
O  -5.215001 1.92898 -0.207769
N  -2.972626 1.688313 -0.472087
C  -3.139658 -0.742165 -0.028479
C  -3.029191 0.371097 -1.056974
C  -0.853839 -1.242959 0.497465
C  1.692427 -2.225775 -0.069888
C  -0.598501 -1.873192 -0.716472
C  0.183779 -1.108933 1.42279
C  0.675764 -2.354145 -0.996512
C  1.445355 -1.600607 1.147078
C  4.034841 -2.005932 -0.354196
C  -4.077384 2.334844 -0.059746
C  4.012421 -0.634373 -0.581068
C  5.242555 -2.665656 -0.153745
C  -4.851161 4.330726 0.948553
C  5.209443 0.070401 -0.594957
C  6.428754 -1.94941 -0.181503
C  6.420253 -0.577046 -0.397114
C  -4.258168 5.594674 1.518702
H  -3.259439 -1.707637 -0.529984
H  -4.027798 -0.591511 0.585858
H  -2.140402 0.247478 -1.675676
H  -3.884769 0.298932 -1.730035
H  -1.366951 -2.003811 -1.465891
H  -0.008567 -0.623919 2.371947
H  0.865349 -2.841526 -1.944786
H  2.232112 -1.499717 1.884869
H  -2.069869 2.075602 -0.245957
H  3.079962 -0.111094 -0.750399
H  5.24813 -3.734765 0.019568
H  -5.446582 3.810586 1.702913
H  -5.504875 4.561007 0.103905
H  5.188253 1.138502 -0.77052
H  7.364947 -2.468985 -0.021187
H  7.347175 -0.018875 -0.408675
H  -5.064793 6.251777 1.845223
H  -3.625215 5.392329 2.383815
H  -3.669669 6.135303 0.776057
elementType: O N C H
totalener: -1015.02732319 hartree
nucrepener: 1654.66920204 hartree
electener: -2669.69652523 hartree
oneelecener: -4667.12221237 hartree
twoeener: 1997.42568715 hartree
cpcmener: -0.03120268 hartree
kineticenergy: 1010.62593275 hartree
xcener: -97.180885725203 hartree
chargesum: 0.0000000
charge: -0.339541 -0.333794 -0.328150 -0.539852 -0.233736 0.031947 -0.077980 0.303405 0.215525 -0.195647 -0.232441 -0.242728 -0.147924 0.289757 0.523173 -0.192059 -0.249011 0.048143 -0.158613 -0.123353 -0.191810 -0.252261 0.103685 0.116600 0.125566 0.104522 0.141498 0.139325 0.146717 0.156288 0.177503 0.152256 0.143681 0.093937 0.091869 0.158327 0.156627 0.156697 0.087642 0.087292 0.086917
qa: -0.3395 -0.3338 -0.3282 -0.5399 -0.2337 0.0319 -0.0780 0.3034 0.2155 -0.1956 -0.2324 -0.2427 -0.1479 0.2898 0.5232 -0.1921 -0.2490 0.0481 -0.1586 -0.1234 -0.1918 -0.2523 0.1037 0.1166 0.1256 0.1045 0.1415 0.1393 0.1467 0.1563 0.1775 0.1523 0.1437 0.0939 0.0919 0.1583 0.1566 0.1567 0.0876 0.0873 0.0869
va: 2.0540 2.0600 2.0704 1.9669 3.1489 3.8213 3.8723 3.7848 3.7462 3.8241 4.0072 4.0366 3.9602 3.6971 4.3024 3.8807 3.9908 3.8459 3.9094 3.8961 3.9042 3.9746 1.0028 1.0086 0.9996 1.0233 1.0064 1.0120 1.0072 0.9939 1.0160 1.0008 1.0098 0.9961 0.9968 0.9909 0.9892 0.9909 1.0069 1.0031 1.0030
dispcorr: -0.016240865 hartree
energy: -1015.043564054094
dipole: -7.99487 8.65487 0.66000 13.88671 -13.04269 0.84402 1.23072 -1.50373 -0.27301
magnitude: 1.10567 au
magnitude: 2.81038 debye
