program: Orca
programVersion: 5.0.2
elementType: O O O O N C C C C C C C C C C C C C C C C C H H H H H H H H H H H H H H H H H H H
charge: 0
multiplicity: 1
keywords: wb97x-d3
keywords: def2-TZVPP
keywords: def2/J RIJCOSX
keywords: DEFGRID2
keywords: scfconv7
keywords: smallprint printgap noloewdin
keywords: NOSOSCF
formula: C17H19NO4
InChI: InChI=1/C17H19NO4/c1-2-20-17(19)18-12-13-21-14-8-10-16(11-9-14)22-15-6-4-3-5-7-15/h3-11,18H,2,12-13H2,1H3
41 atoms
O  -2.948039 -1.808444 -0.227596
O  2.350462 -1.327227 1.176076
O  -2.433466 2.361053 0.825128
O  -2.687529 2.000332 -1.38881
N  -3.898332 0.850951 0.145797
C  -3.531425 -1.109932 -1.32083
C  -4.500087 -0.064392 -0.795221
C  -1.632338 -1.618332 0.04636
C  1.05138 -1.370264 0.747962
C  -1.2701 -1.363821 1.364546
C  -0.637953 -1.733563 -0.920887
C  0.064775 -1.24319 1.71515
C  0.699682 -1.612408 -0.573093
C  3.326342 -0.744189 0.419833
C  -2.974268 1.751981 -0.233161
C  4.581819 -1.337352 0.454431
C  3.117881 0.422224 -0.30666
C  -1.33322 3.248686 0.594236
C  5.634029 -0.755804 -0.237705
C  4.17717 0.986464 -1.002935
C  5.437136 0.40409 -0.974591
C  -0.034649 2.499134 0.404442
H  -2.768466 -0.644217 -1.94779
H  -4.073542 -1.825982 -1.943079
H  -4.925161 0.479015 -1.641308
H  -5.331838 -0.54885 -0.284583
H  -2.036337 -1.268971 2.123927
H  -0.89219 -1.947528 -1.951732
H  0.339111 -1.051902 2.745196
H  1.456064 -1.728496 -1.339167
H  -3.976934 0.634063 1.127054
H  4.732647 -2.244703 1.02617
H  2.145259 0.896506 -0.329696
H  -1.287848 3.868917 1.488755
H  -1.541765 3.905471 -0.25149
H  6.611068 -1.220695 -0.20476
H  4.011599 1.895491 -1.567015
H  6.25818 0.851762 -1.51893
H  0.194645 1.878648 1.271322
H  -0.053207 1.866394 -0.483092
H  0.779134 3.215932 0.285109
elementType: O N C H
totalener: -1015.02348391 hartree
nucrepener: 1793.93496889 hartree
electener: -2808.95845280 hartree
oneelecener: -4946.24197830 hartree
twoeener: 2137.28352550 hartree
cpcmener: -0.02975143 hartree
kineticenergy: 1010.64422881 hartree
xcener: -97.184640923146 hartree
chargesum: 0.0000000
charge: -0.368781 -0.331373 -0.328313 -0.528926 -0.234462 0.053162 -0.054146 0.202826 0.305735 -0.156474 -0.135539 -0.286575 -0.214586 0.263969 0.506417 -0.226627 -0.152885 0.045864 -0.139362 -0.189617 -0.166407 -0.276084 0.091114 0.102437 0.096851 0.105389 0.140302 0.149155 0.141406 0.152429 0.177926 0.143972 0.156369 0.106567 0.089731 0.156736 0.155409 0.156939 0.094171 0.086920 0.108359
qa: -0.3688 -0.3314 -0.3283 -0.5289 -0.2345 0.0532 -0.0541 0.2028 0.3057 -0.1565 -0.1355 -0.2866 -0.2146 0.2640 0.5064 -0.2266 -0.1529 0.0459 -0.1394 -0.1896 -0.1664 -0.2761 0.0911 0.1024 0.0969 0.1054 0.1403 0.1492 0.1414 0.1524 0.1779 0.1440 0.1564 0.1066 0.0897 0.1567 0.1554 0.1569 0.0942 0.0869 0.1084
va: 2.0084 2.0713 2.0716 1.9778 3.1853 3.7744 3.9213 3.8293 3.6333 3.9253 3.8674 3.9932 3.9276 3.7018 4.3176 3.9802 3.8618 3.8868 3.8989 3.9527 3.8866 3.8927 1.0139 1.0056 1.0150 1.0041 1.0056 0.9974 1.0093 0.9992 1.0158 1.0086 0.9814 0.9947 1.0131 0.9895 0.9929 0.9905 0.9972 1.0135 1.0079
dispcorr: -0.021094734 hartree
energy: -1015.044578642538
dipole: -0.43094 0.14028 -0.29066 6.90489 -6.81034 0.09454 -3.02151 3.24082 0.21931
magnitude: 0.37619 au
magnitude: 0.95619 debye
