program: Orca
programVersion: 5.0.2
elementType: O O O O N C C C C C C C C C C C C C C C C C H H H H H H H H H H H H H H H H H H H
charge: 0
multiplicity: 1
keywords: wb97x-d3
keywords: def2-TZVPP
keywords: def2/J RIJCOSX
keywords: DEFGRID2
keywords: scfconv7
keywords: smallprint printgap noloewdin
keywords: NOSOSCF
formula: C17H19NO4
InChI: InChI=1/C17H19NO4/c1-2-20-17(19)18-12-13-21-14-8-10-16(11-9-14)22-15-6-4-3-5-7-15/h3-11,18H,2,12-13H2,1H3
41 atoms
O  -2.192119 -0.931722 -0.092242
O  3.048628 -2.544373 -0.541014
O  -4.294981 3.045804 -0.819523
O  -4.147145 2.659395 1.399866
N  -4.350625 0.961199 -0.094551
C  -2.75296 -0.48114 1.128171
C  -4.195783 -0.109153 0.859659
C  -0.892801 -1.292386 -0.125084
C  1.763856 -2.082933 -0.388977
C  -0.048848 -1.297988 0.982938
C  -0.392529 -1.68832 -1.365279
C  1.274667 -1.697478 0.847864
C  0.929704 -2.072676 -1.498233
C  4.102737 -1.753399 -0.189647
C  -4.245733 2.256229 0.2567
C  5.290244 -2.409478 0.116446
C  4.041402 -0.364488 -0.168961
C  -4.197877 4.461057 -0.623624
C  6.41764 -1.671583 0.441952
C  5.178491 0.35977 0.165628
C  6.368653 -0.283588 0.473554
C  -2.772937 4.922283 -0.418201
H  -2.720207 -1.268476 1.889604
H  -2.201643 0.383873 1.513229
H  -4.740558 -0.976936 0.486518
H  -4.661265 0.167754 1.805287
H  -0.400041 -1.005636 1.96317
H  -1.044718 -1.687461 -2.230199
H  1.916014 -1.708527 1.720877
H  1.310166 -2.374837 -2.466187
H  -4.330066 0.727476 -1.075289
H  5.326406 -3.49196 0.096461
H  3.125739 0.158028 -0.415456
H  -4.840107 4.778089 0.200349
H  -4.605606 4.889262 -1.539088
H  7.338251 -2.189305 0.680106
H  5.127432 1.44119 0.179354
H  7.249024 0.289522 0.733646
H  -2.130536 4.608139 -1.241816
H  -2.7526 6.012447 -0.380507
H  -2.347997 4.551952 0.514254
elementType: O N C H
totalener: -1015.02876236 hartree
nucrepener: 1658.20341228 hartree
electener: -2673.23217464 hartree
oneelecener: -4674.54364411 hartree
twoeener: 2001.31146948 hartree
cpcmener: -0.02935606 hartree
kineticenergy: 1010.62515494 hartree
xcener: -97.180061994520 hartree
chargesum: 0.0000000
charge: -0.330061 -0.334403 -0.333572 -0.539769 -0.238682 0.041069 -0.065178 0.297905 0.209954 -0.186264 -0.223973 -0.205734 -0.187904 0.286681 0.523785 -0.248217 -0.188994 0.046375 -0.124104 -0.160624 -0.191235 -0.253267 0.112611 0.100200 0.108841 0.099578 0.140310 0.138673 0.157934 0.145289 0.175632 0.143762 0.153755 0.087173 0.104020 0.156536 0.158680 0.156961 0.085805 0.093620 0.086832
qa: -0.3301 -0.3344 -0.3336 -0.5398 -0.2387 0.0411 -0.0652 0.2979 0.2100 -0.1863 -0.2240 -0.2057 -0.1879 0.2867 0.5238 -0.2482 -0.1890 0.0464 -0.1241 -0.1606 -0.1912 -0.2533 0.1126 0.1002 0.1088 0.0996 0.1403 0.1387 0.1579 0.1453 0.1756 0.1438 0.1538 0.0872 0.1040 0.1565 0.1587 0.1570 0.0858 0.0936 0.0868
va: 2.0642 2.0610 2.0721 1.9643 3.1750 3.7583 3.9605 3.7983 3.7535 3.8464 3.9872 3.9970 4.0150 3.7010 4.3023 3.9901 3.8779 3.8659 3.8959 3.9102 3.9026 3.9071 0.9960 0.9983 1.0055 1.0202 1.0110 1.0101 0.9963 1.0038 1.0199 1.0095 1.0001 1.0112 0.9957 0.9892 0.9907 0.9908 1.0048 1.0081 1.0156
dispcorr: -0.016007968 hartree
energy: -1015.044770323835
dipole: -5.35566 4.99821 -0.35745 12.51928 -12.36133 0.15794 1.91282 -2.27913 -0.36632
magnitude: 0.53563 au
magnitude: 1.36148 debye
