program: Orca
programVersion: 5.0.2
elementType: O O O O N C C C C C C C C C C C C C C C C C H H H H H H H H H H H H H H H H H H H
charge: 0
multiplicity: 1
keywords: wb97x-d3
keywords: def2-TZVPP
keywords: def2/J RIJCOSX
keywords: DEFGRID2
keywords: scfconv7
keywords: smallprint printgap noloewdin
keywords: NOSOSCF
formula: C17H19NO4
InChI: InChI=1/C17H19NO4/c1-2-20-17(19)18-12-13-21-14-8-10-16(11-9-14)22-15-6-4-3-5-7-15/h3-11,18H,2,12-13H2,1H3
41 atoms
O  -2.163082 -0.891784 0.004647
O  3.034131 -2.60604 -0.543219
O  -4.359787 3.051379 -0.767642
O  -4.131762 2.731339 1.455295
N  -4.338108 0.987333 0.015421
C  -2.684115 -0.400673 1.22658
C  -4.138657 -0.051928 0.995105
C  -0.87184 -1.275435 -0.053807
C  1.760567 -2.122322 -0.369486
C  -0.417945 -1.728709 -1.292075
C  0.006602 -1.251338 1.026331
C  0.892394 -2.141691 -1.451322
C  1.317736 -1.68029 0.865659
C  4.105533 -1.809378 -0.265002
C  -4.256722 2.293467 0.327787
C  5.300259 -2.459889 0.022747
C  4.051384 -0.420611 -0.296915
C  -4.298774 4.473446 -0.612954
C  6.441242 -1.71635 0.279411
C  5.20202 0.309462 -0.030674
C  6.399332 -0.328364 0.259482
C  -2.881484 4.982622 -0.486616
H  -2.618251 -1.159329 2.014538
H  -2.127139 0.4819 1.559849
H  -4.683737 -0.937347 0.665949
H  -4.576888 0.248652 1.946365
H  -1.097794 -1.749693 -2.134715
H  -0.307277 -0.911949 2.003974
H  1.236594 -2.488384 -2.417655
H  1.987031 -1.667844 1.71709
H  -4.346261 0.726276 -0.958245
H  5.331513 -3.542142 0.043401
H  3.130015 0.097293 -0.530563
H  -4.910904 4.792355 0.232129
H  -4.761431 4.864932 -1.51817
H  7.36784 -2.229097 0.503876
H  5.155781 1.390612 -0.057211
H  7.29057 0.248984 0.466452
H  -2.39877 4.639348 0.427448
H  -2.27194 4.677054 -1.337448
H  -2.894737 6.073165 -0.464413
elementType: O N C H
totalener: -1015.02875371 hartree
nucrepener: 1656.07891622 hartree
electener: -2671.10766993 hartree
oneelecener: -4670.27897343 hartree
twoeener: 1999.17130350 hartree
cpcmener: -0.02930991 hartree
kineticenergy: 1010.64898766 hartree
xcener: -97.184580118382 hartree
chargesum: -0.0000000
charge: -0.329590 -0.334561 -0.334246 -0.539715 -0.237867 0.042746 -0.065533 0.297761 0.209010 -0.224709 -0.184924 -0.185543 -0.207190 0.287541 0.523605 -0.247648 -0.189376 0.046515 -0.124403 -0.160965 -0.191216 -0.253871 0.111122 0.100497 0.108630 0.099538 0.138295 0.140286 0.144942 0.158177 0.175456 0.143809 0.153459 0.086835 0.104304 0.156503 0.158669 0.156818 0.087457 0.085953 0.093429
qa: -0.3296 -0.3346 -0.3342 -0.5397 -0.2379 0.0427 -0.0655 0.2978 0.2090 -0.2247 -0.1849 -0.1855 -0.2072 0.2875 0.5236 -0.2476 -0.1894 0.0465 -0.1244 -0.1610 -0.1912 -0.2539 0.1111 0.1005 0.1086 0.0995 0.1383 0.1403 0.1449 0.1582 0.1755 0.1438 0.1535 0.0868 0.1043 0.1565 0.1587 0.1568 0.0875 0.0860 0.0934
va: 2.0652 2.0614 2.0718 1.9640 3.1748 3.7607 3.9602 3.7996 3.7540 3.9867 3.8456 4.0143 3.9974 3.7007 4.3028 3.9907 3.8765 3.8650 3.8967 3.9105 3.9028 3.9086 0.9960 0.9980 1.0057 1.0207 1.0103 1.0110 1.0039 0.9962 1.0200 1.0095 1.0002 1.0118 0.9956 0.9892 0.9908 0.9909 1.0152 1.0048 1.0082
dispcorr: -0.015978909 hartree
energy: -1015.044732622215
dipole: -5.47555 5.10555 -0.37000 12.75278 -12.59752 0.15525 1.64453 -2.00805 -0.36352
magnitude: 0.54143 au
magnitude: 1.37622 debye
