program: Orca
programVersion: 5.0.2
elementType: O O O O N C C C C C C C C C C C C C C C C C H H H H H H H H H H H H H H H H H H H
charge: 0
multiplicity: 1
keywords: wb97x-d3
keywords: def2-TZVPP
keywords: def2/J RIJCOSX
keywords: DEFGRID2
keywords: scfconv7
keywords: smallprint printgap noloewdin
keywords: NOSOSCF
formula: C17H19NO4
InChI: InChI=1/C17H19NO4/c1-2-20-17(19)18-12-13-21-14-8-10-16(11-9-14)22-15-6-4-3-5-7-15/h3-11,18H,2,12-13H2,1H3
41 atoms
O  -1.982718 -0.767346 -0.034361
O  3.17459 -2.537314 -0.725202
O  -4.710631 3.018891 -0.773605
O  -4.705898 2.718952 1.462946
N  -4.213235 1.026853 0.025093
C  -2.473665 -0.270611 1.197427
C  -3.947047 0.01348 1.014274
C  -0.691473 -1.145384 -0.127669
C  1.928842 -2.009212 -0.507801
C  0.232539 -1.06055 0.90936
C  -0.28786 -1.660417 -1.358912
C  1.537914 -1.498903 0.718971
C  1.01461 -2.081264 -1.550225
C  4.297978 -1.884054 -0.311678
C  -4.549498 2.290531 0.3354
C  5.384435 -2.681291 0.027745
C  4.401693 -0.498154 -0.276804
C  -5.092743 4.391814 -0.634282
C  6.580615 -2.087967 0.400911
C  5.603789 0.080522 0.107733
C  6.696114 -0.705171 0.4487
C  -3.929014 5.292335 -0.291049
H  -2.347078 -1.010273 1.996093
H  -1.942141 0.641714 1.491177
H  -4.466328 -0.905082 0.732551
H  -4.359754 0.325449 1.972048
H  -0.040175 -0.66922 1.880143
H  -1.002232 -1.726951 -2.170197
H  2.2365 -1.443833 1.54482
H  1.317883 -2.481394 -2.509625
H  -4.096664 0.786035 -0.947762
H  5.29099 -3.759729 -0.005923
H  3.563923 0.130722 -0.550601
H  -5.899618 4.491381 0.094594
H  -5.500226 4.657761 -1.609279
H  7.424052 -2.713833 0.663109
H  5.683158 1.159879 0.133939
H  7.628914 -0.244477 0.74586
H  -4.263763 6.330638 -0.317415
H  -3.532049 5.099412 0.704956
H  -3.118979 5.189169 -1.014182
elementType: O N C H
totalener: -1015.02802410 hartree
nucrepener: 1636.04856641 hartree
electener: -2651.07659051 hartree
oneelecener: -4630.12194475 hartree
twoeener: 1979.04535424 hartree
cpcmener: -0.02911839 hartree
kineticenergy: 1010.64512059 hartree
xcener: -97.184569453049 hartree
chargesum: 0.0000000
charge: -0.330973 -0.333839 -0.335176 -0.541223 -0.230878 0.048842 -0.067561 0.287509 0.243105 -0.182286 -0.212320 -0.220565 -0.210932 0.298285 0.520546 -0.257080 -0.200688 0.043504 -0.119065 -0.149554 -0.193586 -0.252699 0.105235 0.101174 0.107874 0.096721 0.140888 0.138994 0.157164 0.144404 0.174652 0.143793 0.154796 0.087346 0.104512 0.157217 0.158615 0.157196 0.093181 0.087186 0.085686
qa: -0.3310 -0.3338 -0.3352 -0.5412 -0.2309 0.0488 -0.0676 0.2875 0.2431 -0.1823 -0.2123 -0.2206 -0.2109 0.2983 0.5205 -0.2571 -0.2007 0.0435 -0.1191 -0.1496 -0.1936 -0.2527 0.1052 0.1012 0.1079 0.0967 0.1409 0.1390 0.1572 0.1444 0.1747 0.1438 0.1548 0.0873 0.1045 0.1572 0.1586 0.1572 0.0932 0.0872 0.0857
va: 2.0651 2.0644 2.0663 1.9636 3.1709 3.8075 3.9434 3.8075 3.7276 3.8541 3.9862 3.9906 4.0259 3.6915 4.3050 4.0014 3.9002 3.8686 3.8866 3.8987 3.9070 3.9064 0.9960 0.9938 1.0039 1.0290 1.0101 1.0092 0.9967 1.0056 1.0216 1.0097 0.9990 1.0107 0.9955 0.9892 0.9906 0.9909 1.0080 1.0160 1.0048
dispcorr: -0.015645470 hartree
energy: -1015.043669571688
dipole: -7.26303 7.24557 -0.01746 12.98010 -12.84714 0.13296 2.46159 -2.74872 -0.28713
magnitude: 0.31690 au
magnitude: 0.80550 debye
