program: Orca
programVersion: 5.0.2
elementType: O O O O N C C C C C C C C C C C C C C C C C H H H H H H H H H H H H H H H H H H H
charge: 0
multiplicity: 1
keywords: wb97x-d3
keywords: def2-TZVPP
keywords: def2/J RIJCOSX
keywords: DEFGRID2
keywords: scfconv7
keywords: smallprint printgap noloewdin
keywords: NOSOSCF
formula: C17H19NO4
InChI: InChI=1/C17H19NO4/c1-2-20-17(19)18-12-13-21-14-8-10-16(11-9-14)22-15-6-4-3-5-7-15/h3-11,18H,2,12-13H2,1H3
41 atoms
O  -3.09334 -2.027189 -0.458841
O  2.121407 -1.379506 1.201921
O  -0.943764 1.853852 -0.333585
O  -2.959771 1.906202 0.679661
N  -2.638979 0.776761 -1.2602
C  -4.063095 -1.00894 -0.256751
C  -3.925741 0.119199 -1.267397
C  -1.824983 -1.8257 -0.013625
C  0.827211 -1.515066 0.765569
C  -0.790599 -2.264845 -0.836524
C  -1.519543 -1.256776 1.218657
C  0.529941 -2.122482 -0.446945
C  -0.194333 -1.087852 1.595901
C  3.030231 -0.709723 0.436907
C  -2.237576 1.540053 -0.2272
C  2.676993 0.244047 -0.511104
C  4.368761 -0.999521 0.677943
C  -0.36099 2.658963 0.698378
C  3.677145 0.89667 -1.219893
C  5.354277 -0.334088 -0.033405
C  5.015652 0.613775 -0.990284
C  -0.628746 4.132919 0.502664
H  -5.034092 -1.485519 -0.398072
H  -4.04458 -0.626602 0.765534
H  -4.079938 -0.268637 -2.2740
H  -4.722773 0.842375 -1.083372
H  -1.023934 -2.72188 -1.790226
H  -2.296697 -0.931736 1.897102
H  1.321808 -2.47399 -1.09679
H  0.0383 -0.630739 2.549569
H  -1.936305 0.441655 -1.900957
H  1.639467 0.485528 -0.703684
H  4.631475 -1.742465 1.42061
H  0.707309 2.455314 0.63205
H  -0.698236 2.321519 1.679628
H  3.398891 1.637623 -1.958233
H  6.394059 -0.566037 0.158523
H  5.787044 1.12681 -1.548955
H  -1.685674 4.378632 0.598741
H  -0.087651 4.696759 1.263969
H  -0.279335 4.474481 -0.472091
elementType: O N C H
totalener: -1015.02387569 hartree
nucrepener: 1826.14054759 hartree
electener: -2841.16442328 hartree
oneelecener: -5010.37659128 hartree
twoeener: 2169.21216799 hartree
cpcmener: -0.02876287 hartree
kineticenergy: 1010.64938047 hartree
xcener: -97.187483966106 hartree
chargesum: 0.0000000
charge: -0.356431 -0.333233 -0.325019 -0.522531 -0.214544 0.028083 -0.039322 0.185877 0.278541 -0.187375 -0.080494 -0.170314 -0.307395 0.319786 0.468451 -0.214137 -0.243807 0.057361 -0.176519 -0.127751 -0.182848 -0.254283 0.110481 0.096625 0.105212 0.096866 0.140090 0.149245 0.154971 0.145519 0.178004 0.150984 0.143088 0.100321 0.089275 0.155994 0.156044 0.156348 0.088095 0.095348 0.085395
qa: -0.3564 -0.3332 -0.3250 -0.5225 -0.2145 0.0281 -0.0393 0.1859 0.2785 -0.1874 -0.0805 -0.1703 -0.3074 0.3198 0.4685 -0.2141 -0.2438 0.0574 -0.1765 -0.1278 -0.1828 -0.2543 0.1105 0.0966 0.1052 0.0969 0.1401 0.1492 0.1550 0.1455 0.1780 0.1510 0.1431 0.1003 0.0893 0.1560 0.1560 0.1563 0.0881 0.0953 0.0854
va: 2.0279 2.0705 2.0599 1.9816 3.1742 3.8283 3.8859 3.8497 3.6640 3.9731 3.6827 3.9547 3.9933 3.6552 4.3760 3.8639 3.9871 3.8202 3.9406 3.8987 3.9002 3.9481 1.0060 1.0071 1.0054 1.0171 1.0102 1.0021 0.9941 1.0086 1.0128 1.0015 1.0099 0.9908 1.0107 0.9927 0.9893 0.9906 1.0152 1.0061 1.0047
dispcorr: -0.021814190 hartree
energy: -1015.045689879243
dipole: -2.07642 2.23201 0.15559 11.13415 -10.86247 0.27168 -2.02925 0.86690 -1.16235
magnitude: 1.20377 au
magnitude: 3.05974 debye
