program: Orca
programVersion: 5.0.2
elementType: O O O O N C C C C C C C C C C C C C C C C C H H H H H H H H H H H H H H H H H H H
charge: 0
multiplicity: 1
keywords: wb97x-d3
keywords: def2-TZVPP
keywords: def2/J RIJCOSX
keywords: DEFGRID2
keywords: scfconv7
keywords: smallprint printgap noloewdin
keywords: NOSOSCF
formula: C17H19NO4
InChI: InChI=1/C17H19NO4/c1-2-20-17(19)18-12-13-21-14-8-10-16(11-9-14)22-15-6-4-3-5-7-15/h3-11,18H,2,12-13H2,1H3
41 atoms
O  -2.151552 -0.936901 0.204888
O  3.111695 -2.466848 0.668618
O  -4.339317 3.105367 0.864202
O  -4.370876 2.65018 -1.34634
N  -4.272947 0.999274 0.211813
C  -2.730124 -0.495853 -1.010453
C  -4.16171 -0.102397 -0.711911
C  -0.845201 -1.274831 0.233376
C  1.827077 -2.017427 0.49782
C  -0.334238 -1.6499 1.475634
C  -0.00473 -1.278843 -0.87606
C  0.993787 -2.009806 1.608677
C  1.32689 -1.65434 -0.741639
C  4.168579 -1.77462 0.153654
C  -4.323415 2.282345 -0.188692
C  5.290717 -2.522441 -0.184932
C  4.17625 -0.391374 0.014181
C  -4.407992 4.514291 0.621398
C  6.424578 -1.882133 -0.660468
C  5.31648 0.234032 -0.472209
C  6.443287 -0.501838 -0.811519
C  -3.076699 5.107267 0.21825
H  -2.179707 0.359435 -1.417683
H  -2.721164 -1.293948 -1.761377
H  -4.653083 0.153154 -1.649756
H  -4.701448 -0.955233 -0.29806
H  -0.984352 -1.652036 2.341844
H  -0.364335 -1.004872 -1.858605
H  1.381728 -2.297015 2.578059
H  1.962379 -1.665032 -1.618672
H  -4.18004 0.805744 1.196252
H  5.272455 -3.599244 -0.070225
H  3.311051 0.200611 0.284613
H  -4.733869 4.934735 1.572267
H  -5.181058 4.737566 -0.11654
H  7.295552 -2.470125 -0.920552
H  5.320944 1.3112 -0.579233
H  7.327589 -0.004829 -1.188153
H  -2.748738 4.763755 -0.761929
H  -3.170375 6.193269 0.174201
H  -2.300073 4.872409 0.947074
elementType: O N C H
totalener: -1015.02842646 hartree
nucrepener: 1650.04973204 hartree
electener: -2665.07815850 hartree
oneelecener: -4658.21151605 hartree
twoeener: 1993.13335755 hartree
cpcmener: -0.02922186 hartree
kineticenergy: 1010.63129366 hartree
xcener: -97.181711127777 hartree
chargesum: -0.0000000
charge: -0.330196 -0.334161 -0.334396 -0.540091 -0.234602 0.044421 -0.067337 0.289279 0.231626 -0.215043 -0.183895 -0.204726 -0.213526 0.289946 0.522815 -0.253191 -0.192922 0.044640 -0.121446 -0.153049 -0.192207 -0.252758 0.099336 0.110536 0.098114 0.108881 0.138439 0.140491 0.144697 0.157036 0.175317 0.143625 0.154562 0.103902 0.087725 0.157039 0.158862 0.156933 0.086249 0.093748 0.085328
qa: -0.3302 -0.3342 -0.3344 -0.5401 -0.2346 0.0444 -0.0673 0.2893 0.2316 -0.2150 -0.1839 -0.2047 -0.2135 0.2899 0.5228 -0.2532 -0.1929 0.0446 -0.1214 -0.1530 -0.1922 -0.2528 0.0993 0.1105 0.0981 0.1089 0.1384 0.1405 0.1447 0.1570 0.1753 0.1436 0.1546 0.1039 0.0877 0.1570 0.1589 0.1569 0.0862 0.0937 0.0853
va: 2.0634 2.0627 2.0689 1.9635 3.1744 3.7790 3.9529 3.8059 3.7366 3.9874 3.8516 4.0223 3.9879 3.6988 4.3015 3.9974 3.8931 3.8689 3.8896 3.9023 3.9051 3.9037 0.9962 0.9958 1.0241 1.0051 1.0100 1.0105 1.0051 0.9967 1.0206 1.0096 0.9991 0.9959 1.0099 0.9892 0.9906 0.9910 1.0167 1.0081 1.0050
dispcorr: -0.015856496 hartree
energy: -1015.044282960371
dipole: -6.00324 5.80681 -0.19643 12.59931 -12.44332 0.15600 -2.70923 3.02267 0.31343
magnitude: 0.40145 au
magnitude: 1.02039 debye
