program: Orca
programVersion: 5.0.2
elementType: O O O O N C C C C C C C C C C C C C C C C C H H H H H H H H H H H H H H H H H H H
charge: 0
multiplicity: 1
keywords: wb97x-d3
keywords: def2-TZVPP
keywords: def2/J RIJCOSX
keywords: DEFGRID2
keywords: scfconv7
keywords: smallprint printgap noloewdin
keywords: NOSOSCF
formula: C17H19NO4
InChI: InChI=1/C17H19NO4/c1-2-20-17(19)18-12-13-21-14-8-10-16(11-9-14)22-15-6-4-3-5-7-15/h3-11,18H,2,12-13H2,1H3
41 atoms
O  -2.096164 -0.838159 -0.140505
O  3.085855 -2.537614 -0.858747
O  -4.447328 3.19956 -0.580789
O  -4.403942 2.69007 1.617723
N  -4.228894 1.087713 0.01476
C  -2.611848 -0.426366 1.112648
C  -4.059311 -0.035831 0.901956
C  -0.803352 -1.214482 -0.233248
C  1.827696 -2.042854 -0.626891
C  0.088046 -1.25209 0.835114
C  -0.362755 -1.594679 -1.500578
C  1.398469 -1.670965 0.636208
C  0.944847 -1.997538 -1.697859
C  4.190042 -1.888086 -0.389398
C  -4.356623 2.353608 0.450542
C  4.254404 -0.507341 -0.240251
C  5.298628 -2.678834 -0.108926
C  -4.630792 4.591225 -0.300257
C  5.437776 0.071829 0.1982
C  6.475502 -2.084436 0.319501
C  6.551058 -0.707233 0.48086
C  -3.348153 5.288215 0.093817
H  -2.56085 -1.241155 1.843755
H  -2.043946 0.422428 1.509284
H  -4.615905 -0.88411 0.500316
H  -4.498227 0.194925 1.871541
H  -0.214742 -0.972054 1.834984
H  -1.0523 -1.568599 -2.335471
H  2.073997 -1.708813 1.482067
H  1.277276 -2.289792 -2.686227
H  -4.168896 0.924237 -0.977843
H  3.399823 0.117906 -0.465769
H  5.235872 -3.753168 -0.23137
H  -5.404831 4.728838 0.457386
H  -5.011765 5.005097 -1.233523
H  5.486216 1.147145 0.313426
H  7.335432 -2.705742 0.53494
H  7.468866 -0.245874 0.820915
H  -2.973701 4.953915 1.060478
H  -2.567735 5.137059 -0.652988
H  -3.534195 6.360877 0.163762
elementType: O N C H
totalener: -1015.02829055 hartree
nucrepener: 1643.29373777 hartree
electener: -2658.32202832 hartree
oneelecener: -4644.67886950 hartree
twoeener: 1986.35684118 hartree
cpcmener: -0.02921846 hartree
kineticenergy: 1010.62885045 hartree
xcener: -97.181329433193 hartree
chargesum: 0.0000000
charge: -0.330040 -0.334231 -0.334971 -0.540298 -0.232973 0.047921 -0.069662 0.289124 0.232623 -0.183145 -0.214737 -0.214302 -0.205417 0.290962 0.522676 -0.194177 -0.253001 0.044337 -0.152433 -0.121506 -0.192298 -0.252791 0.108315 0.099762 0.108924 0.097804 0.140422 0.138735 0.157449 0.144389 0.175245 0.154232 0.143686 0.087562 0.103737 0.158645 0.156926 0.157064 0.086824 0.085174 0.093446
qa: -0.3300 -0.3342 -0.3350 -0.5403 -0.2330 0.0479 -0.0697 0.2891 0.2326 -0.1831 -0.2147 -0.2143 -0.2054 0.2910 0.5227 -0.1942 -0.2530 0.0443 -0.1524 -0.1215 -0.1923 -0.2528 0.1083 0.0998 0.1089 0.0978 0.1404 0.1387 0.1574 0.1444 0.1752 0.1542 0.1437 0.0876 0.1037 0.1586 0.1569 0.1571 0.0868 0.0852 0.0934
va: 2.0655 2.0630 2.0675 1.9635 3.1727 3.7877 3.9506 3.8062 3.7356 3.8506 3.9875 3.9896 4.0241 3.6980 4.3013 3.8935 3.9969 3.8694 3.9021 3.8902 3.9055 3.9040 0.9958 0.9951 1.0047 1.0257 1.0105 1.0097 0.9965 1.0052 1.0207 0.9992 1.0096 1.0100 0.9958 0.9906 0.9893 0.9909 1.0163 1.0050 1.0081
dispcorr: -0.015756434 hartree
energy: -1015.044046981823
dipole: -6.36892 6.18239 -0.18653 12.84942 -12.67975 0.16967 3.34762 -3.64979 -0.30217
magnitude: 0.39356 au
magnitude: 1.00034 debye
