program: Orca
programVersion: 5.0.2
elementType: O O O O N C C C C C C C C C C C C C C C C C H H H H H H H H H H H H H H H H H H H
charge: 0
multiplicity: 1
keywords: wb97x-d3
keywords: def2-TZVPP
keywords: def2/J RIJCOSX
keywords: DEFGRID2
keywords: scfconv7
keywords: smallprint printgap noloewdin
keywords: NOSOSCF
formula: C17H19NO4
InChI: InChI=1/C17H19NO4/c1-2-20-17(19)18-12-13-21-14-8-10-16(11-9-14)22-15-6-4-3-5-7-15/h3-11,18H,2,12-13H2,1H3
41 atoms
O  -1.653176 0.004887 -0.917434
O  3.315976 -1.402942 0.977226
O  -4.594812 3.158862 0.478941
O  -5.365127 1.116863 1.056197
N  -4.114537 1.436738 -0.813137
C  -2.835591 -0.661315 -0.514398
C  -3.999146 0.045829 -1.176432
C  -0.464914 -0.398467 -0.424819
C  2.082053 -1.076216 0.471853
C  0.642618 0.371329 -0.786463
C  -0.284026 -1.506206 0.395624
C  1.90616 0.04013 -0.339109
C  0.992507 -1.844993 0.833652
C  4.37032 -1.541706 0.120543
C  -4.736066 1.841444 0.309175
C  5.622636 -1.181685 0.602015
C  4.230308 -2.057774 -1.163012
C  -5.196092 3.764974 1.628235
C  6.739176 -1.342646 -0.204642
C  5.35616 -2.20568 -1.960934
C  6.612693 -1.849306 -1.491098
C  -4.32984 3.641885 2.85963
H  -2.825526 -1.710335 -0.830699
H  -2.941726 -0.638636 0.575743
H  -3.897834 -0.011677 -2.260726
H  -4.917089 -0.482477 -0.920944
H  0.50475 1.240453 -1.41776
H  -1.115496 -2.126995 0.700775
H  2.750294 0.657874 -0.620289
H  1.127488 -2.71241 1.467613
H  -3.541054 2.10171 -1.308443
H  5.71955 -0.78029 1.603089
H  3.259082 -2.349032 -1.542831
H  -6.192134 3.35479 1.801052
H  -5.316588 4.812374 1.353162
H  7.712528 -1.059462 0.174875
H  5.244553 -2.607953 -2.959683
H  7.484775 -1.96734 -2.120451
H  -4.208377 2.606665 3.177788
H  -3.341665 4.072859 2.695311
H  -4.796063 4.187741 3.681064
elementType: O N C H
totalener: -1015.02850636 hartree
nucrepener: 1648.92748008 hartree
electener: -2663.95598645 hartree
oneelecener: -4656.05603646 hartree
twoeener: 1992.10005001 hartree
cpcmener: -0.02948543 hartree
kineticenergy: 1010.64783671 hartree
xcener: -97.183955557843 hartree
chargesum: 0.0000000
charge: -0.329733 -0.336600 -0.333990 -0.539943 -0.238571 0.039947 -0.061908 0.298013 0.216112 -0.238382 -0.177142 -0.140570 -0.258311 0.258572 0.523329 -0.235610 -0.170619 0.045674 -0.129566 -0.161785 -0.182520 -0.251742 0.110823 0.100562 0.108515 0.098096 0.139031 0.140573 0.156932 0.146530 0.176163 0.144936 0.154624 0.087023 0.104248 0.156389 0.158333 0.157119 0.086451 0.086443 0.092556
qa: -0.3297 -0.3366 -0.3340 -0.5399 -0.2386 0.0399 -0.0619 0.2980 0.2161 -0.2384 -0.1771 -0.1406 -0.2583 0.2586 0.5233 -0.2356 -0.1706 0.0457 -0.1296 -0.1618 -0.1825 -0.2517 0.1108 0.1006 0.1085 0.0981 0.1390 0.1406 0.1569 0.1465 0.1762 0.1449 0.1546 0.0870 0.1042 0.1564 0.1583 0.1571 0.0865 0.0864 0.0926
va: 2.0625 2.0536 2.0718 1.9643 3.1736 3.7643 3.9616 3.8014 3.7505 4.0000 3.8417 3.9380 4.0573 3.7157 4.3050 3.9881 3.8752 3.8641 3.8973 3.9088 3.8962 3.9124 0.9959 0.9986 1.0049 1.0208 1.0114 1.0099 0.9939 1.0078 1.0197 1.0084 0.9980 1.0126 0.9952 0.9895 0.9909 0.9906 1.0143 1.0045 1.0084
dispcorr: -0.016019889 hartree
energy: -1015.044526252556
dipole: -8.91782 9.07521 0.15740 6.15895 -5.75985 0.39910 2.63288 -3.64635 -1.01347
magnitude: 1.10054 au
magnitude: 2.79734 debye
