program: Orca
programVersion: 5.0.2
elementType: O O O O N C C C C C C C C C C C C C C C C C H H H H H H H H H H H H H H H H H H H
charge: 0
multiplicity: 1
keywords: wb97x-d3
keywords: def2-TZVPP
keywords: def2/J RIJCOSX
keywords: DEFGRID2
keywords: scfconv7
keywords: smallprint printgap noloewdin
keywords: NOSOSCF
formula: C17H19NO4
InChI: InChI=1/C17H19NO4/c1-2-20-17(19)18-12-13-21-14-8-10-16(11-9-14)22-15-6-4-3-5-7-15/h3-11,18H,2,12-13H2,1H3
41 atoms
O  -3.213445 -1.590957 0.259453
O  2.24005 -1.58098 0.988101
O  -2.340814 2.536816 0.482838
O  -1.10165 1.483495 -1.079434
N  -3.308471 1.012905 -0.785406
C  -3.823019 -1.387469 -1.001873
C  -3.382374 -0.101229 -1.694338
C  -1.8630 -1.598072 0.359625
C  0.886811 -1.571475 0.753726
C  -1.009077 -2.049532 -0.642771
C  -1.328889 -1.146274 1.562668
C  0.363526 -2.036332 -0.442785
C  0.041536 -1.132038 1.759775
C  3.059872 -0.794198 0.234081
C  -2.159397 1.655092 -0.503937
C  2.610092 0.274888 -0.53294
C  4.416723 -1.097883 0.287945
C  -1.227992 3.347073 0.880176
C  3.530031 1.02613 -1.253743
C  5.320569 -0.334365 -0.43255
C  4.884099 0.729046 -1.212862
C  -0.293529 2.63193 1.827892
H  -3.665137 -2.234041 -1.678731
H  -4.891086 -1.349386 -0.784187
H  -2.412976 -0.2187 -2.173043
H  -4.099047 0.100135 -2.49501
H  -1.394672 -2.422616 -1.582878
H  -1.991507 -0.79434 2.343568
H  1.020364 -2.391574 -1.227459
H  0.45131 -0.769433 2.694103
H  -4.125154 1.235552 -0.235884
H  1.559657 0.530933 -0.582689
H  4.756821 -1.930192 0.891813
H  -1.682141 4.205215 1.374988
H  -0.693254 3.718008 0.004022
H  3.174238 1.854944 -1.852528
H  6.374042 -0.579407 -0.387158
H  5.591716 1.318291 -1.780953
H  0.45084 3.34139 2.19333
H  -0.82811 2.23968 2.694183
H  0.241065 1.813636 1.347294
elementType: O N C H
totalener: -1015.02345847 hartree
nucrepener: 1827.34047507 hartree
electener: -2842.36393354 hartree
oneelecener: -5013.94159795 hartree
twoeener: 2171.57766440 hartree
cpcmener: -0.03181894 hartree
kineticenergy: 1010.64519253 hartree
xcener: -97.188372873240 hartree
chargesum: 0.0000000
charge: -0.347568 -0.333921 -0.330050 -0.531375 -0.213285 0.019757 -0.072520 0.224744 0.281051 -0.164738 -0.139557 -0.197341 -0.278330 0.315821 0.499592 -0.188312 -0.237851 0.045608 -0.191389 -0.131731 -0.182103 -0.243707 0.098343 0.115875 0.114428 0.114454 0.148509 0.138768 0.155657 0.147240 0.167842 0.134370 0.142195 0.105082 0.088470 0.156838 0.155750 0.156056 0.103444 0.088514 0.065369
qa: -0.3476 -0.3339 -0.3300 -0.5314 -0.2133 0.0198 -0.0725 0.2247 0.2811 -0.1647 -0.1396 -0.1973 -0.2783 0.3158 0.4996 -0.1883 -0.2379 0.0456 -0.1914 -0.1317 -0.1821 -0.2437 0.0983 0.1159 0.1144 0.1145 0.1485 0.1388 0.1557 0.1472 0.1678 0.1344 0.1422 0.1051 0.0885 0.1568 0.1557 0.1561 0.1034 0.0885 0.0654
va: 2.0404 2.0704 2.0645 1.9601 3.1729 3.8710 3.8442 3.7725 3.6547 3.8028 3.8760 3.9861 4.0015 3.6547 4.3181 3.8455 3.9788 3.8637 3.9497 3.9033 3.8963 3.9065 0.9983 0.9927 1.0212 1.0068 0.9998 1.0104 0.9968 1.0017 1.0203 1.0165 1.0107 0.9962 1.0107 0.9920 0.9895 0.9906 1.0115 1.0061 1.0002
dispcorr: -0.021755146 hartree
energy: -1015.045213615508
dipole: -2.18708 0.51267 -1.67441 7.66130 -7.19252 0.46878 -1.00955 0.58344 -0.42611
magnitude: 1.79024 au
magnitude: 4.55043 debye
