program: Orca
programVersion: 5.0.2
elementType: O O O O N C C C C C C C C C C C C C C C C C H H H H H H H H H H H H H H H H H H H
charge: 0
multiplicity: 1
keywords: wb97x-d3
keywords: def2-TZVPP
keywords: def2/J RIJCOSX
keywords: DEFGRID2
keywords: scfconv7
keywords: smallprint printgap noloewdin
keywords: NOSOSCF
formula: C17H19NO4
InChI: InChI=1/C17H19NO4/c1-2-20-17(19)18-12-13-21-14-8-10-16(11-9-14)22-15-6-4-3-5-7-15/h3-11,18H,2,12-13H2,1H3
41 atoms
O  -3.241823 -1.938929 0.190738
O  2.252482 -2.034179 0.584772
O  -0.929606 1.992239 -0.148138
O  -2.673911 1.945699 -1.580996
N  -2.810568 1.024192 0.488593
C  -3.972294 -0.94272 -0.509058
C  -4.072404 0.354294 0.277204
C  -1.886011 -1.900166 0.222579
C  0.888877 -1.952194 0.453218
C  -1.280165 -2.426544 1.359473
C  -1.085591 -1.41871 -0.81118
C  0.100491 -2.448967 1.477874
C  0.295182 -1.444636 -0.693398
C  3.021936 -0.923492 0.395825
C  -2.177201 1.674979 -0.504599
C  4.337355 -1.141844 0.002177
C  2.559965 0.369006 0.619036
C  -0.138874 2.770714 -1.054141
C  5.189437 -0.062348 -0.171863
C  3.424021 1.439653 0.431708
C  4.737904 1.234595 0.035137
C  -0.319891 4.25174 -0.818803
H  -3.572832 -0.768794 -1.510948
H  -4.975893 -1.350541 -0.636658
H  -4.767203 1.018082 -0.239846
H  -4.504154 0.153265 1.257409
H  -1.896293 -2.810696 2.163198
H  -1.514425 -1.01795 -1.719916
H  0.56085 -2.851717 2.371538
H  0.902396 -1.066287 -1.506664
H  -2.279695 0.784228 1.311389
H  4.687433 -2.153221 -0.164242
H  1.540634 0.55117 0.935671
H  -0.363055 2.503413 -2.087296
H  0.890289 2.472788 -0.855259
H  6.212149 -0.239326 -0.479556
H  3.061117 2.444798 0.605461
H  5.403091 2.075471 -0.109983
H  -0.083333 4.522872 0.210919
H  0.356601 4.80579 -1.471025
H  -1.336349 4.579785 -1.038971
elementType: O N C H
totalener: -1015.02394007 hartree
nucrepener: 1812.23869301 hartree
electener: -2827.26263308 hartree
oneelecener: -4982.29603489 hartree
twoeener: 2155.03340181 hartree
cpcmener: -0.02910806 hartree
kineticenergy: 1010.64126992 hartree
xcener: -97.185420538313 hartree
chargesum: -0.0000000
charge: -0.349459 -0.335920 -0.326296 -0.525369 -0.231714 0.021900 -0.033029 0.206113 0.269185 -0.179806 -0.135329 -0.218645 -0.236779 0.298014 0.489052 -0.252948 -0.198816 0.053596 -0.120609 -0.154730 -0.195042 -0.250767 0.099496 0.112905 0.097709 0.103878 0.137670 0.148213 0.144347 0.157385 0.181667 0.143553 0.154869 0.092035 0.090384 0.156519 0.160289 0.156762 0.084897 0.094907 0.089912
qa: -0.3495 -0.3359 -0.3263 -0.5254 -0.2317 0.0219 -0.0330 0.2061 0.2692 -0.1798 -0.1353 -0.2186 -0.2368 0.2980 0.4891 -0.2529 -0.1988 0.0536 -0.1206 -0.1547 -0.1950 -0.2508 0.0995 0.1129 0.0977 0.1039 0.1377 0.1482 0.1443 0.1574 0.1817 0.1436 0.1549 0.0920 0.0904 0.1565 0.1603 0.1568 0.0849 0.0949 0.0899
va: 2.0426 2.0675 2.0675 1.9838 3.1688 3.8349 3.8839 3.7970 3.6761 3.9821 3.7525 4.0422 3.9572 3.7031 4.3483 3.9999 3.8650 3.8345 3.8945 3.8843 3.9147 3.9367 1.0047 1.0049 1.0191 1.0074 1.0102 1.0073 1.0045 0.9974 1.0102 1.0095 1.0057 1.0190 0.9952 0.9888 0.9902 0.9912 1.0050 1.0075 1.0110
dispcorr: -0.021235652 hartree
energy: -1015.045175725114
dipole: -1.71991 1.69920 -0.02071 13.00903 -12.35525 0.65378 -2.62312 3.24444 0.62132
magnitude: 0.90216 au
magnitude: 2.29311 debye
