program: Orca
programVersion: 5.0.2
elementType: O O O O N C C C C C C C C C C C C C C C C C H H H H H H H H H H H H H H H H H H H
charge: 0
multiplicity: 1
keywords: wb97x-d3
keywords: def2-TZVPP
keywords: def2/J RIJCOSX
keywords: DEFGRID2
keywords: scfconv7
keywords: smallprint printgap noloewdin
keywords: NOSOSCF
formula: C17H19NO4
InChI: InChI=1/C17H19NO4/c1-2-20-17(19)18-12-13-21-14-8-10-16(11-9-14)22-15-6-4-3-5-7-15/h3-11,18H,2,12-13H2,1H3
41 atoms
O  -1.978275 -0.517049 -0.722305
O  3.0278 -2.731531 -0.11736
O  -3.877913 3.6376 0.321791
O  -5.188213 1.975366 1.105612
N  -2.936105 1.737027 0.935067
C  -3.011711 -0.638273 0.240681
C  -2.880069 0.364566 1.374299
C  -0.764993 -1.065685 -0.491595
C  1.796264 -2.138136 -0.24387
C  0.18527 -0.880908 -1.498648
C  -0.415615 -1.795303 0.64072
C  1.453249 -1.417017 -1.381978
C  0.866328 -2.321334 0.76136
C  4.158032 -1.970533 -0.180233
C  -4.092733 2.410747 0.806647
C  5.32942 -2.634526 -0.528287
C  4.183139 -0.613038 0.119083
C  -5.010122 4.490772 0.120632
C  6.525119 -1.935681 -0.58181
C  5.388289 0.074272 0.052831
C  6.562105 -0.576342 -0.298545
C  -5.749078 4.187555 -1.162457
H  -3.93829 -0.454825 -0.305112
H  -3.071596 -1.655245 0.640451
H  -3.678353 0.174514 2.092208
H  -1.94244 0.224274 1.913413
H  -0.081969 -0.321622 -2.386808
H  -1.114544 -1.969374 1.447141
H  2.169509 -1.275888 -2.182228
H  1.130179 -2.886211 1.646839
H  -2.087771 2.166787 0.600797
H  5.299707 -3.693407 -0.753558
H  3.281603 -0.086802 0.405467
H  -4.588778 5.494923 0.084951
H  -5.67937 4.446934 0.98176
H  7.432279 -2.458666 -0.856689
H  5.403043 1.131875 0.28348
H  7.495239 -0.031107 -0.350422
H  -5.085241 4.240709 -2.0261
H  -6.221844 3.206004 -1.147272
H  -6.535594 4.930473 -1.303522
elementType: O N C H
totalener: -1015.02650792 hartree
nucrepener: 1653.43758006 hartree
electener: -2668.46408798 hartree
oneelecener: -4664.68770197 hartree
twoeener: 1996.22361399 hartree
cpcmener: -0.03047406 hartree
kineticenergy: 1010.62819996 hartree
xcener: -97.182233446758 hartree
chargesum: 0.0000000
charge: -0.337812 -0.333515 -0.335302 -0.540887 -0.229599 0.033348 -0.074584 0.302315 0.220945 -0.230930 -0.185442 -0.155218 -0.249806 0.293211 0.523495 -0.250234 -0.193946 0.044691 -0.123109 -0.158931 -0.192084 -0.252253 0.115960 0.101908 0.100584 0.124230 0.139372 0.139421 0.156716 0.146590 0.176133 0.143737 0.152443 0.104059 0.087361 0.156798 0.158295 0.156560 0.085694 0.086313 0.093471
qa: -0.3378 -0.3335 -0.3353 -0.5409 -0.2296 0.0333 -0.0746 0.3023 0.2209 -0.2309 -0.1854 -0.1552 -0.2498 0.2932 0.5235 -0.2502 -0.1939 0.0447 -0.1231 -0.1589 -0.1921 -0.2523 0.1160 0.1019 0.1006 0.1242 0.1394 0.1394 0.1567 0.1466 0.1761 0.1437 0.1524 0.1041 0.0874 0.1568 0.1583 0.1566 0.0857 0.0863 0.0935
va: 2.0576 2.0609 2.0697 1.9625 3.1553 3.8488 3.8687 3.7889 3.7417 4.0043 3.8240 3.9632 4.0429 3.6952 4.3037 3.9918 3.8813 3.8672 3.8948 3.9099 3.9044 3.9082 1.0045 1.0031 1.0265 0.9996 1.0118 1.0076 0.9937 1.0075 1.0181 1.0097 1.0005 0.9958 1.0112 0.9891 0.9909 0.9910 1.0048 1.0157 1.0080
dispcorr: -0.016433385 hartree
energy: -1015.042941305178
dipole: -10.81142 11.39971 0.58828 10.78264 -10.04533 0.73731 -0.78410 0.87793 0.09384
magnitude: 0.94790 au
magnitude: 2.40936 debye
