program: Orca
programVersion: 5.0.2
elementType: O O O O N C C C C C C C C C C C C C C C C C H H H H H H H H H H H H H H H H H H H
charge: 0
multiplicity: 1
keywords: wb97x-d3
keywords: def2-TZVPP
keywords: def2/J RIJCOSX
keywords: DEFGRID2
keywords: scfconv7
keywords: smallprint printgap noloewdin
keywords: NOSOSCF
formula: C17H19NO4
InChI: InChI=1/C17H19NO4/c1-2-20-17(19)18-12-13-21-14-8-10-16(11-9-14)22-15-6-4-3-5-7-15/h3-11,18H,2,12-13H2,1H3
41 atoms
O  -2.160148 -0.887716 -0.602248
O  2.951901 -2.808898 0.111868
O  -3.633669 3.543603 -0.431772
O  -4.962915 2.208782 0.812504
N  -2.754106 1.764864 0.538314
C  -3.070195 -0.688696 0.466817
C  -2.742037 0.539514 1.298499
C  -0.914578 -1.347847 -0.348828
C  1.693138 -2.285425 -0.052518
C  -0.475123 -1.824394 0.882321
C  -0.032849 -1.353079 -1.431869
C  0.829674 -2.282603 1.026061
C  1.258732 -1.82317 -1.289434
C  4.047134 -2.035125 -0.135681
C  -3.874126 2.481837 0.343687
C  4.025452 -0.645701 -0.099556
C  5.233271 -2.71273 -0.39645
C  -4.708698 4.459978 -0.666986
C  5.199241 0.05772 -0.336173
C  6.396859 -1.995771 -0.623668
C  6.387356 -0.607137 -0.600498
C  -4.88488 5.439185 0.470287
H  -4.044501 -0.562913 -0.006496
H  -3.138157 -1.572885 1.108363
H  -3.465178 0.601761 2.112051
H  -1.761949 0.448023 1.767021
H  -1.121687 -1.849111 1.748534
H  -0.370427 -0.991819 -2.395405
H  1.164603 -2.646229 1.989491
H  1.924026 -1.829185 -2.144247
H  -1.908299 2.047901 0.069393
H  3.11189 -0.106187 0.115162
H  5.240103 -3.795326 -0.41807
H  -5.634008 3.919814 -0.871292
H  -4.426795 4.98511 -1.578682
H  5.177837 1.139515 -0.308133
H  7.316279 -2.529796 -0.826975
H  7.296309 -0.050514 -0.785891
H  -5.19759 4.949299 1.392086
H  -3.964661 5.990657 0.665394
H  -5.65441 6.164386 0.203018
elementType: O N C H
totalener: -1015.02655420 hartree
nucrepener: 1658.76324343 hartree
electener: -2673.78979763 hartree
oneelecener: -4675.31310507 hartree
twoeener: 2001.52330745 hartree
cpcmener: -0.03057936 hartree
kineticenergy: 1010.64298221 hartree
xcener: -97.185189296290 hartree
chargesum: 0.0000000
charge: -0.340047 -0.333293 -0.335433 -0.541843 -0.227819 0.035822 -0.083677 0.305732 0.212419 -0.202852 -0.230980 -0.232337 -0.149518 0.294857 0.522160 -0.194123 -0.250671 0.045808 -0.161273 -0.122399 -0.192245 -0.252012 0.115154 0.102513 0.103063 0.128511 0.141342 0.138597 0.146543 0.156620 0.176803 0.152667 0.143637 0.086702 0.104794 0.158490 0.156371 0.156755 0.086582 0.085570 0.093008
qa: -0.3400 -0.3333 -0.3354 -0.5418 -0.2278 0.0358 -0.0837 0.3057 0.2124 -0.2029 -0.2310 -0.2323 -0.1495 0.2949 0.5222 -0.1941 -0.2507 0.0458 -0.1613 -0.1224 -0.1922 -0.2520 0.1152 0.1025 0.1031 0.1285 0.1413 0.1386 0.1465 0.1566 0.1768 0.1527 0.1436 0.0867 0.1048 0.1585 0.1564 0.1568 0.0866 0.0856 0.0930
va: 2.0565 2.0614 2.0721 1.9611 3.1494 3.8365 3.8674 3.7769 3.7502 3.8245 4.0085 4.0303 3.9601 3.6944 4.3056 3.8792 3.9918 3.8638 3.9124 3.8964 3.9047 3.9110 1.0056 1.0022 1.0269 0.9982 1.0063 1.0123 1.0069 0.9937 1.0170 1.0009 1.0098 1.0130 0.9954 0.9909 0.9893 0.9909 1.0151 1.0050 1.0082
dispcorr: -0.016522890 hartree
energy: -1015.043077090067
dipole: -8.97882 9.63424 0.65543 13.91401 -13.11377 0.80024 2.33518 -2.26738 0.06780
magnitude: 1.03661 au
magnitude: 2.63486 debye
