program: Orca
programVersion: 5.0.2
elementType: O O O O N C C C C C C C C C C C C C C C C C H H H H H H H H H H H H H H H H H H H
charge: 0
multiplicity: 1
keywords: wb97x-d3
keywords: def2-TZVPP
keywords: def2/J RIJCOSX
keywords: DEFGRID2
keywords: scfconv7
keywords: smallprint printgap noloewdin
keywords: NOSOSCF
formula: C17H19NO4
InChI: InChI=1/C17H19NO4/c1-2-20-17(19)18-12-13-21-14-8-10-16(11-9-14)22-15-6-4-3-5-7-15/h3-11,18H,2,12-13H2,1H3
41 atoms
O  -2.737245 -1.928511 0.497653
O  2.457123 -1.250913 -1.199162
O  -2.12613 2.701676 0.491828
O  -3.703168 1.931883 -0.931678
N  -3.302843 0.917004 1.055632
C  -3.867018 -1.259927 -0.019022
C  -4.292253 -0.115215 0.886541
C  -1.490375 -1.678571 0.040737
C  1.168041 -1.376907 -0.752423
C  -0.478206 -2.436745 0.632455
C  -1.15304 -0.765708 -0.95228
C  0.837408 -2.290802 0.240994
C  0.174121 -0.618315 -1.33926
C  3.423082 -0.844006 -0.331081
C  -3.092261 1.859751 0.109252
C  4.73103 -1.190753 -0.650413
C  3.157407 -0.091124 0.806951
C  -1.732476 3.711099 -0.436046
C  5.769033 -0.783263 0.170021
C  4.208953 0.305369 1.620951
C  5.515974 -0.036787 1.312534
C  -0.786339 3.186212 -1.496074
H  -3.717711 -0.911047 -1.042326
H  -4.673894 -1.996283 -0.050111
H  -5.211413 0.318449 0.488185
H  -4.529842 -0.508418 1.875845
H  -0.739792 -3.154307 1.399175
H  -1.894739 -0.149417 -1.440499
H  1.608291 -2.89383 0.703968
H  0.430082 0.092828 -2.113878
H  -2.675133 0.871537 1.838936
H  4.922814 -1.776321 -1.540028
H  2.142925 0.188575 1.059013
H  -1.238115 4.465857 0.175033
H  -2.610376 4.170577 -0.893169
H  6.78439 -1.058422 -0.083832
H  3.997432 0.892171 2.505347
H  6.329101 0.274647 1.953883
H  -0.429371 4.014749 -2.108866
H  0.081984 2.703104 -1.047934
H  -1.281004 2.476332 -2.157268
totalener: -1015.00239258 hartree
nucrepener: 1764.39990355 hartree
electener: -2779.40229613 hartree
oneelecener: -4886.21074974 hartree
twoeener: 2106.80845361 hartree
kineticenergy: 1010.68491627 hartree
xcener: -97.189781740432 hartree
chargesum: -0.0000000
charge: -0.303294 -0.302331 -0.307702 -0.424592 -0.237074 0.014059 -0.046042 0.245935 0.191231 -0.194474 -0.111075 -0.122197 -0.230399 0.246434 0.441468 -0.208406 -0.156174 0.043285 -0.092165 -0.133655 -0.149153 -0.272775 0.102343 0.099755 0.094838 0.092289 0.117988 0.112127 0.129565 0.129840 0.152985 0.123104 0.125057 0.095639 0.089457 0.122405 0.123718 0.122904 0.091823 0.087817 0.095440
qa: -0.3033 -0.3023 -0.3077 -0.4246 -0.2371 0.0141 -0.0460 0.2459 0.1912 -0.1945 -0.1111 -0.1222 -0.2304 0.2464 0.4415 -0.2084 -0.1562 0.0433 -0.0922 -0.1337 -0.1492 -0.2728 0.1023 0.0998 0.0948 0.0923 0.1180 0.1121 0.1296 0.1298 0.1530 0.1231 0.1251 0.0956 0.0895 0.1224 0.1237 0.1229 0.0918 0.0878 0.0954
va: 2.0888 2.0932 2.0803 2.0806 3.1643 3.8275 3.9308 3.9013 3.8827 4.0148 3.7836 3.9962 4.0602 3.8144 4.3641 4.0211 3.9037 3.8803 3.9463 3.9701 3.9596 3.9064 1.0017 1.0034 1.0201 1.0038 1.0165 1.0253 1.0020 1.0109 1.0327 1.0153 1.0099 0.9947 1.0106 0.9990 1.0004 1.0008 1.0140 1.0027 1.0079
dispcorr: -0.019600038 hartree
energy: -1015.021992618900
dipole: -2.55764 2.41526 -0.14238 8.08357 -7.86031 0.22326 -0.11375 0.92595 0.81220
magnitude: 0.85427 au
magnitude: 2.17138 debye
