program: Orca
programVersion: 5.0.2
elementType: O O O O N C C C C C C C C C C C C C C C C C H H H H H H H H H H H H H H H H H H H
charge: 0
multiplicity: 1
keywords: wb97x-d3
keywords: def2-TZVPP
keywords: def2/J RIJCOSX
keywords: DEFGRID2
keywords: scfconv7
keywords: smallprint printgap noloewdin
keywords: NOSOSCF
formula: C17H19NO4
InChI: InChI=1/C17H19NO4/c1-2-20-17(19)18-12-13-21-14-8-10-16(11-9-14)22-15-6-4-3-5-7-15/h3-11,18H,2,12-13H2,1H3
41 atoms
O  -2.715874 -1.979118 -0.845059
O  2.163861 0.090789 0.642332
O  -2.038553 2.444014 0.050516
O  -3.711309 1.476728 1.223201
N  -3.298407 0.922935 -0.937619
C  -3.886998 -1.408796 -0.291735
C  -4.283422 -0.125737 -1.007644
C  -1.514745 -1.488081 -0.442578
C  0.99167 -0.493847 0.251371
C  -0.574854 -1.192306 -1.424667
C  -1.175386 -1.31187 0.893993
C  0.671354 -0.693951 -1.08488
C  0.074601 -0.821461 1.235918
C  3.34904 -0.324696 0.115892
C  -3.064197 1.601443 0.211019
C  4.343843 0.634903 -0.020066
C  3.597899 -1.647948 -0.228618
C  -1.680049 3.265655 1.159311
C  5.590694 0.267036 -0.498662
C  4.848793 -1.99916 -0.713366
C  5.849498 -1.049101 -0.85271
C  -0.778616 2.55471 2.144793
H  -4.678879 -2.149106 -0.419164
H  -3.788222 -1.219727 0.779698
H  -4.46432 -0.336067 -2.062485
H  -5.227089 0.227832 -0.587256
H  -0.831687 -1.347105 -2.465059
H  -1.873419 -1.559261 1.682426
H  1.38303 -0.44793 -1.862663
H  0.33561 -0.677801 2.276185
H  -2.620188 1.001669 -1.675292
H  4.134103 1.660265 0.255192
H  2.828227 -2.400341 -0.114707
H  -2.575349 3.641726 1.657424
H  -1.161584 4.115268 0.714601
H  6.362524 1.018517 -0.601347
H  5.040965 -3.030624 -0.977998
H  6.822464 -1.332111 -1.230505
H  -1.290704 1.721347 2.622691
H  0.123509 2.179749 1.662212
H  -0.476116 3.25355 2.925855
totalener: -1015.00012816 hartree
nucrepener: 1794.29651673 hartree
electener: -2809.29664489 hartree
oneelecener: -4946.21300187 hartree
twoeener: 2136.91635698 hartree
kineticenergy: 1010.70334204 hartree
xcener: -97.192412234415 hartree
chargesum: -0.0000000
charge: -0.320726 -0.308895 -0.304334 -0.428219 -0.230033 0.019673 -0.053723 0.198881 0.264255 -0.209353 -0.067746 -0.126727 -0.285114 0.249229 0.455320 -0.221179 -0.166961 0.039937 -0.090388 -0.120671 -0.146996 -0.252357 0.094884 0.094972 0.091821 0.090844 0.128555 0.116407 0.135377 0.133942 0.151056 0.121895 0.131889 0.087818 0.091932 0.123612 0.125797 0.123751 0.089006 0.082129 0.090444
qa: -0.3207 -0.3089 -0.3043 -0.4282 -0.2300 0.0197 -0.0537 0.1989 0.2643 -0.2094 -0.0677 -0.1267 -0.2851 0.2492 0.4553 -0.2212 -0.1670 0.0399 -0.0904 -0.1207 -0.1470 -0.2524 0.0949 0.0950 0.0918 0.0908 0.1286 0.1164 0.1354 0.1339 0.1511 0.1219 0.1319 0.0878 0.0919 0.1236 0.1258 0.1238 0.0890 0.0821 0.0904
va: 2.0544 2.0659 2.0828 2.0816 3.1711 3.8418 3.9247 3.9229 3.7198 3.9975 3.7915 3.9648 4.0211 3.8148 4.3558 4.0389 3.9325 3.8918 3.9400 3.9553 3.9610 3.9105 1.0069 1.0077 1.0050 1.0194 1.0122 1.0073 1.0002 1.0093 1.0348 1.0151 1.0065 1.0122 0.9946 0.9992 1.0003 1.0008 1.0147 1.0049 1.0131
dispcorr: -0.020999959 hartree
energy: -1015.021128117766
dipole: -1.91473 2.14212 0.22740 4.15005 -4.11743 0.03262 2.43311 -3.06893 -0.63582
magnitude: 0.67605 au
magnitude: 1.71838 debye
