program: Orca
programVersion: 5.0.2
elementType: O O O O N C C C C C C C C C C C C C C C C C H H H H H H H H H H H H H H H H H H H
charge: 0
multiplicity: 1
keywords: wb97x-d3
keywords: def2-TZVPP
keywords: def2/J RIJCOSX
keywords: DEFGRID2
keywords: scfconv7
keywords: smallprint printgap noloewdin
keywords: NOSOSCF
formula: C17H19NO4
InChI: InChI=1/C17H19NO4/c1-2-20-17(19)18-12-13-21-14-8-10-16(11-9-14)22-15-6-4-3-5-7-15/h3-11,18H,2,12-13H2,1H3
41 atoms
O  -2.572408 -2.217814 -0.181962
O  2.23349 0.461518 -0.393622
O  -2.310685 2.231824 0.900339
O  -3.835002 1.703373 -0.68243
N  -3.419826 0.328897 1.073144
C  -3.770112 -1.546753 -0.525726
C  -4.30421 -0.719961 0.635069
C  -1.39979 -1.539891 -0.270735
C  1.069677 -0.254979 -0.346412
C  -0.507986 -1.657802 0.791101
C  -1.034659 -0.786715 -1.380633
C  0.718634 -1.017885 0.759548
C  0.197771 -0.152833 -1.41687
C  3.415796 -0.142562 -0.089892
C  -3.231846 1.447189 0.332586
C  3.664644 -1.486715 -0.342248
C  4.407319 0.66298 0.455509
C  -1.974716 3.442808 0.226973
C  4.909232 -2.016203 -0.036313
C  5.648225 0.121071 0.747616
C  5.905586 -1.22132 0.509709
C  -0.960619 3.22598 -0.875549
H  -3.652368 -0.914798 -1.408819
H  -4.495838 -2.322597 -0.776299
H  -5.264772 -0.291396 0.341942
H  -4.493538 -1.370082 1.490141
H  -0.786006 -2.254937 1.650264
H  -1.69497 -0.692822 -2.232225
H  1.393787 -1.106286 1.601171
H  0.480491 0.434494 -2.28066
H  -2.775161 0.143079 1.82156
H  2.899604 -2.117089 -0.776278
H  4.1994 1.708113 0.643881
H  -1.561241 4.084881 1.004602
H  -2.873766 3.923423 -0.16202
H  5.098794 -3.062912 -0.234597
H  6.416488 0.753992 1.171881
H  6.873251 -1.642626 0.745252
H  -0.060296 2.74103 -0.49911
H  -1.37201 2.618285 -1.679741
H  -0.671853 4.18891 -1.299008
totalener: -1015.00036827 hartree
nucrepener: 1787.88094236 hartree
electener: -2802.88131063 hartree
oneelecener: -4933.36318119 hartree
twoeener: 2130.48187056 hartree
kineticenergy: 1010.70301701 hartree
xcener: -97.192291473452 hartree
chargesum: -0.0000000
charge: -0.319777 -0.308243 -0.304910 -0.429476 -0.230435 0.016952 -0.052541 0.199415 0.262576 -0.202380 -0.073331 -0.130161 -0.283062 0.251753 0.457358 -0.169235 -0.221688 0.040406 -0.121503 -0.089862 -0.148390 -0.253202 0.096085 0.095249 0.091678 0.092153 0.128158 0.116971 0.135305 0.134614 0.150128 0.132009 0.120976 0.092792 0.087628 0.125374 0.124038 0.124188 0.083763 0.089197 0.089432
qa: -0.3198 -0.3082 -0.3049 -0.4295 -0.2304 0.0170 -0.0525 0.1994 0.2626 -0.2024 -0.0733 -0.1302 -0.2831 0.2518 0.4574 -0.1692 -0.2217 0.0404 -0.1215 -0.0899 -0.1484 -0.2532 0.0961 0.0952 0.0917 0.0922 0.1282 0.1170 0.1353 0.1346 0.1501 0.1320 0.1210 0.0928 0.0876 0.1254 0.1240 0.1242 0.0838 0.0892 0.0894
va: 2.0558 2.0674 2.0842 2.0801 3.1701 3.8419 3.9243 3.9234 3.7257 3.9929 3.7873 3.9668 4.0197 3.8137 4.3537 3.9256 4.0397 3.8917 3.9551 3.9398 3.9619 3.9114 1.0076 1.0066 1.0195 1.0048 1.0126 1.0075 0.9999 1.0090 1.0354 1.0066 1.0160 0.9944 1.0124 1.0004 0.9989 1.0007 1.0034 1.0144 1.0131
dispcorr: -0.020778613 hartree
energy: -1015.021146878927
dipole: -2.26069 2.43182 0.17113 4.52324 -4.76096 -0.23773 -0.73409 1.31590 0.58181
magnitude: 0.65138 au
magnitude: 1.65569 debye
