program: Orca
programVersion: 5.0.2
elementType: O O O O N C C C C C C C C C C C C C C C C C H H H H H H H H H H H H H H H H H H H
charge: 0
multiplicity: 1
keywords: wb97x-d3
keywords: def2-TZVPP
keywords: def2/J RIJCOSX
keywords: DEFGRID2
keywords: scfconv7
keywords: smallprint printgap noloewdin
keywords: NOSOSCF
formula: C17H19NO4
InChI: InChI=1/C17H19NO4/c1-2-20-17(19)18-12-13-21-14-8-10-16(11-9-14)22-15-6-4-3-5-7-15/h3-11,18H,2,12-13H2,1H3
41 atoms
O  -3.264146 -1.883639 0.266962
O  2.236607 -1.921629 0.497687
O  -0.892144 2.011826 -0.831054
O  -2.800544 2.384266 0.318329
N  -2.637269 0.694481 -1.184061
C  -4.015856 -0.690014 0.365731
C  -3.941456 0.148525 -0.902643
C  -1.912161 -1.825664 0.354426
C  0.869825 -1.865491 0.445655
C  -1.228932 -1.045179 1.284109
C  -1.188731 -2.636886 -0.512319
C  0.154364 -1.066626 1.326103
C  0.196834 -2.655485 -0.4702
C  2.959418 -0.813297 0.177068
C  -2.159795 1.751816 -0.487216
C  4.281761 -0.794517 0.607621
C  2.449164 0.248705 -0.560906
C  -0.26094 3.121704 -0.191502
C  5.089202 0.286837 0.30025
C  3.27357 1.325707 -0.858813
C  4.590909 1.356407 -0.431786
C  0.250113 2.78994 1.194106
H  -5.048542 -1.005729 0.522181
H  -3.731345 -0.086631 1.231721
H  -4.242837 -0.456847 -1.758615
H  -4.662715 0.963405 -0.818667
H  -1.761801 -0.416798 1.985386
H  -1.720459 -3.255848 -1.223616
H  0.67859 -0.460763 2.054341
H  0.755947 -3.284943 -1.150181
H  -1.997221 0.164311 -1.749807
H  4.66544 -1.629053 1.179945
H  1.421906 0.249538 -0.90123
H  -0.941434 3.974242 -0.15893
H  0.568564 3.380786 -0.849939
H  6.116049 0.294819 0.641807
H  2.873012 2.147635 -1.438539
H  5.223894 2.201283 -0.667014
H  0.945495 1.951517 1.169502
H  0.786558 3.650155 1.596421
H  -0.566267 2.559011 1.876251
totalener: -1015.00069595 hartree
nucrepener: 1840.06199054 hartree
electener: -2855.06268648 hartree
oneelecener: -5037.37054180 hartree
twoeener: 2182.30785532 hartree
kineticenergy: 1010.69240965 hartree
xcener: -97.191349063483 hartree
chargesum: -0.0000000
charge: -0.310570 -0.303400 -0.308643 -0.424518 -0.230591 0.007659 -0.044918 0.183445 0.236207 -0.110049 -0.176922 -0.207567 -0.154610 0.289831 0.444131 -0.210367 -0.208495 0.008652 -0.089878 -0.139412 -0.150459 -0.262359 0.098370 0.097499 0.094708 0.094236 0.122259 0.122817 0.139258 0.124645 0.153002 0.123198 0.132426 0.105058 0.099271 0.123337 0.128876 0.123061 0.078644 0.095507 0.106662
qa: -0.3106 -0.3034 -0.3086 -0.4245 -0.2306 0.0077 -0.0449 0.1834 0.2362 -0.1100 -0.1769 -0.2076 -0.1546 0.2898 0.4441 -0.2104 -0.2085 0.0087 -0.0899 -0.1394 -0.1505 -0.2624 0.0984 0.0975 0.0947 0.0942 0.1223 0.1228 0.1393 0.1246 0.1530 0.1232 0.1324 0.1051 0.0993 0.1233 0.1289 0.1231 0.0786 0.0955 0.1067
va: 2.0696 2.1064 2.0607 2.0851 3.1639 3.8572 3.9024 3.8684 3.8042 3.7904 3.9786 3.9983 4.0266 3.7583 4.3636 4.0305 3.8455 3.8624 3.9484 3.9282 3.9719 3.8962 1.0063 1.0043 1.0058 1.0217 1.0105 1.0150 0.9979 1.0090 1.0307 1.0154 1.0242 1.0146 0.9923 0.9984 0.9968 1.0008 0.9992 1.0160 1.0132
dispcorr: -0.023067622 hartree
energy: -1015.023763568095
dipole: -0.67555 0.70586 0.03031 10.16827 -9.99377 0.17450 0.92687 -1.41446 -0.48760
magnitude: 0.51877 au
magnitude: 1.31860 debye
