program: Orca
programVersion: 5.0.2
elementType: O O O O N C C C C C C C C C C C C C C C C C H H H H H H H H H H H H H H H H H H H
charge: 0
multiplicity: 1
keywords: wb97x-d3
keywords: def2-TZVPP
keywords: def2/J RIJCOSX
keywords: DEFGRID2
keywords: scfconv7
keywords: smallprint printgap noloewdin
keywords: NOSOSCF
formula: C17H19NO4
InChI: InChI=1/C17H19NO4/c1-2-20-17(19)18-12-13-21-14-8-10-16(11-9-14)22-15-6-4-3-5-7-15/h3-11,18H,2,12-13H2,1H3
41 atoms
O  -2.426829 -2.062599 -0.517973
O  2.44695 0.475884 -0.168397
O  -2.851608 2.543916 -0.170525
O  -3.953166 1.364624 1.411729
N  -3.72395 0.587238 -0.70682
C  -3.570116 -1.715941 0.233449
C  -4.405018 -0.659502 -0.475818
C  -1.258331 -1.399208 -0.363754
C  1.250892 -0.186831 -0.232149
C  -0.320068 -1.590023 -1.378865
C  -0.922967 -0.593721 0.719199
C  0.92127 -0.986169 -1.319359
C  0.331521 -0.001535 0.782793
C  3.610766 -0.229302 -0.177177
C  -3.537905 1.490882 0.283286
C  3.700566 -1.566318 0.192193
C  4.752811 0.470586 -0.550843
C  -2.554232 3.586518 0.755323
C  4.93812 -2.194664 0.172933
C  5.980448 -0.169505 -0.558872
C  6.081687 -1.507326 -0.202599
C  -1.349098 3.270286 1.615601
H  -4.162186 -2.629011 0.322927
H  -3.327522 -1.396611 1.248609
H  -4.724894 -1.044074 -1.445148
H  -5.309252 -0.481955 0.109392
H  -0.578674 -2.215957 -2.223106
H  -1.616065 -0.403466 1.526631
H  1.63233 -1.135703 -2.122077
H  0.588066 0.621049 1.629774
H  -3.24886 0.730669 -1.581161
H  2.819987 -2.1167 0.496687
H  4.668108 1.512325 -0.831656
H  -3.426078 3.806362 1.374207
H  -2.357469 4.458124 0.131149
H  5.00254 -3.235701 0.461562
H  6.863803 0.382161 -0.85361
H  7.041124 -2.006645 -0.215362
H  -1.548072 2.438517 2.28978
H  -0.480354 3.027063 1.004039
H  -1.098657 4.139298 2.225299
totalener: -1015.00185378 hartree
nucrepener: 1759.15378793 hartree
electener: -2774.15564171 hartree
oneelecener: -4875.83710868 hartree
twoeener: 2101.68146697 hartree
kineticenergy: 1010.68586104 hartree
xcener: -97.190652211800 hartree
chargesum: -0.0000000
charge: -0.305090 -0.303115 -0.304575 -0.425773 -0.237858 0.008325 -0.043509 0.213241 0.219913 -0.175284 -0.098643 -0.136456 -0.251244 0.259195 0.442927 -0.168093 -0.220755 0.043634 -0.126663 -0.089040 -0.151542 -0.276803 0.099870 0.102691 0.092160 0.093902 0.119298 0.117257 0.130819 0.133210 0.154509 0.130257 0.120795 0.088686 0.094688 0.124741 0.122719 0.122513 0.095355 0.091356 0.092380
qa: -0.3051 -0.3031 -0.3046 -0.4258 -0.2379 0.0083 -0.0435 0.2132 0.2199 -0.1753 -0.0986 -0.1365 -0.2512 0.2592 0.4429 -0.1681 -0.2208 0.0436 -0.1267 -0.0890 -0.1515 -0.2768 0.0999 0.1027 0.0922 0.0939 0.1193 0.1173 0.1308 0.1332 0.1545 0.1303 0.1208 0.0887 0.0947 0.1247 0.1227 0.1225 0.0954 0.0914 0.0924
va: 2.0862 2.0906 2.0825 2.0830 3.1605 3.8404 3.9272 3.9037 3.8499 3.9987 3.7457 4.0012 4.0529 3.8097 4.3691 3.9156 4.0292 3.8816 3.9619 3.9422 3.9632 3.9080 1.0040 1.0005 1.0041 1.0197 1.0162 1.0218 1.0014 1.0077 1.0310 1.0076 1.0163 1.0104 0.9948 1.0004 0.9988 1.0010 1.0091 1.0008 1.0140
dispcorr: -0.019818187 hartree
energy: -1015.021671963591
dipole: -3.17875 2.97475 -0.20400 4.09155 -4.16195 -0.07040 3.54121 -4.07997 -0.53875
magnitude: 0.58037 au
magnitude: 1.47518 debye
