program: Orca
programVersion: 5.0.2
elementType: O O O O N C C C C C C C C C C C C C C C C C H H H H H H H H H H H H H H H H H H H
charge: 0
multiplicity: 1
keywords: wb97x-d3
keywords: def2-TZVPP
keywords: def2/J RIJCOSX
keywords: DEFGRID2
keywords: scfconv7
keywords: smallprint printgap noloewdin
keywords: NOSOSCF
formula: C17H19NO4
InChI: InChI=1/C17H19NO4/c1-2-20-17(19)18-12-13-21-14-8-10-16(11-9-14)22-15-6-4-3-5-7-15/h3-11,18H,2,12-13H2,1H3
41 atoms
O  -3.078162 -2.028166 0.590673
O  2.170486 -1.630262 -1.025686
O  -1.168946 2.071556 0.137449
O  -3.137885 1.802382 -0.926938
N  -2.761902 0.875557 1.109736
C  -4.06613 -1.077264 0.253442
C  -4.006784 0.149849 1.154572
C  -1.810648 -1.882481 0.137085
C  0.861851 -1.712038 -0.627796
C  -0.809114 -2.442953 0.928217
C  -1.460917 -1.259706 -1.057091
C  0.517626 -2.364421 0.547389
C  -0.126565 -1.165522 -1.425551
C  3.010235 -0.797344 -0.353771
C  -2.414201 1.600595 0.018984
C  2.577847 0.170234 0.545988
C  4.367195 -0.941595 -0.625443
C  -0.678242 2.846323 -0.956861
C  3.513997 0.984746 1.169749
C  5.285404 -0.118573 0.002519
C  4.867069 0.848078 0.90766
C  0.70847 3.328591 -0.603366
H  -4.024985 -0.783763 -0.797029
H  -5.024868 -1.576436 0.404831
H  -4.828877 0.814831 0.883268
H  -4.171245 -0.151414 2.189659
H  -1.083131 -2.945884 1.846573
H  -2.204384 -0.823952 -1.70951
H  1.287514 -2.802893 1.169396
H  0.143101 -0.668039 -2.34822
H  -2.041466 0.63887 1.769265
H  1.524842 0.302037 0.75834
H  4.68964 -1.697813 -1.329155
H  -1.346731 3.688763 -1.147968
H  -0.657051 2.236151 -1.863583
H  3.170385 1.737758 1.8672
H  6.338641 -0.238122 -0.215412
H  5.587916 1.48707 1.399323
H  1.094843 3.94209 -1.417054
H  0.702359 3.939325 0.299519
H  1.401495 2.500703 -0.457418
totalener: -1015.00156009 hartree
nucrepener: 1823.80329130 hartree
electener: -2838.80485140 hartree
oneelecener: -5004.93223533 hartree
twoeener: 2166.12738394 hartree
kineticenergy: 1010.69439077 hartree
xcener: -97.191758386409 hartree
chargesum: -0.0000000
charge: -0.307090 -0.303982 -0.302458 -0.414607 -0.226441 0.005013 -0.040531 0.183572 0.241058 -0.172584 -0.075627 -0.136884 -0.258247 0.294375 0.417653 -0.202105 -0.209341 0.024025 -0.147390 -0.092974 -0.147504 -0.228768 0.103416 0.099033 0.093525 0.092786 0.121443 0.127960 0.128654 0.126704 0.150283 0.123935 0.122356 0.103101 0.086790 0.127618 0.123070 0.123301 0.082365 0.081902 0.082594
qa: -0.3071 -0.3040 -0.3025 -0.4146 -0.2264 0.0050 -0.0405 0.1836 0.2411 -0.1726 -0.0756 -0.1369 -0.2582 0.2944 0.4177 -0.2021 -0.2093 0.0240 -0.1474 -0.0930 -0.1475 -0.2288 0.1034 0.0990 0.0935 0.0928 0.1214 0.1280 0.1287 0.1267 0.1503 0.1239 0.1224 0.1031 0.0868 0.1276 0.1231 0.1233 0.0824 0.0819 0.0826
va: 2.0808 2.1072 2.0666 2.0979 3.1638 3.8454 3.9165 3.8908 3.7936 3.9890 3.6936 4.0058 4.0420 3.7730 4.4057 3.8684 4.0250 3.8635 3.9626 3.9493 3.9635 3.9550 1.0015 1.0048 1.0182 1.0043 1.0158 1.0187 1.0028 1.0120 1.0319 1.0202 1.0157 1.0045 0.9974 0.9995 0.9985 1.0003 1.0132 1.0058 1.0019
dispcorr: -0.021716082 hartree
energy: -1015.023276176817
dipole: 0.27632 -0.26428 0.01204 10.24013 -9.95341 0.28672 1.36064 -0.62927 0.73138
magnitude: 0.78566 au
magnitude: 1.99699 debye
