program: Orca
programVersion: 5.0.2
elementType: O O O O N C C C C C C C C C C C C C C C C C H H H H H H H H H H H H H H H H H H H
charge: 0
multiplicity: 1
keywords: wb97x-d3
keywords: def2-TZVPP
keywords: def2/J RIJCOSX
keywords: DEFGRID2
keywords: scfconv7
keywords: smallprint printgap noloewdin
keywords: NOSOSCF
formula: C17H19NO4
InChI: InChI=1/C17H19NO4/c1-2-20-17(19)18-12-13-21-14-8-10-16(11-9-14)22-15-6-4-3-5-7-15/h3-11,18H,2,12-13H2,1H3
41 atoms
O  -1.897461 -0.974631 0.572383
O  3.145095 -2.915741 -0.435665
O  -5.148531 3.537801 -0.402258
O  -3.983736 2.884754 1.419697
N  -4.513915 1.42731 -0.239107
C  -2.413394 0.175107 -0.050847
C  -3.875718 0.282353 0.354316
C  -0.637117 -1.36629 0.293652
C  1.925884 -2.352696 -0.179111
C  -0.19919 -2.529714 0.923105
C  0.225401 -0.696493 -0.567665
C  1.073928 -3.014271 0.695063
C  1.499097 -1.195625 -0.807948
C  4.275461 -2.159383 -0.384941
C  -4.499199 2.645049 0.356018
C  4.41997 -1.061634 0.45574
C  5.329031 -2.563639 -1.195399
C  -5.247565 4.868547 0.102657
C  5.623888 -0.372751 0.472317
C  6.527501 -1.87018 -1.161236
C  6.681393 -0.767932 -0.332669
C  -3.987751 5.676285 -0.125471
H  -1.873727 1.075625 0.265584
H  -2.335986 0.102447 -1.143611
H  -4.410175 -0.616358 0.042821
H  -3.954694 0.346138 1.439113
H  -0.867805 -3.048174 1.59766
H  -0.073374 0.213436 -1.069618
H  1.409278 -3.917909 1.186824
H  2.154117 -0.672121 -1.492576
H  -4.95418 1.337458 -1.137762
H  3.607245 -0.746657 1.097014
H  5.201663 -3.421749 -1.842264
H  -5.508418 4.852757 1.162265
H  -6.084688 5.305115 -0.441957
H  5.733074 0.480214 1.129309
H  7.344071 -2.191694 -1.794356
H  7.61639 -0.224946 -0.312378
H  -3.718263 5.702449 -1.181542
H  -4.152843 6.704048 0.200104
H  -3.148342 5.27931 0.442415
totalener: -1015.00333708 hartree
nucrepener: 1624.62869902 hartree
electener: -2639.63203610 hartree
oneelecener: -4606.66832542 hartree
twoeener: 1967.03628932 hartree
kineticenergy: 1010.69193963 hartree
xcener: -97.187982476180 hartree
chargesum: -0.0000000
charge: -0.291725 -0.303003 -0.318733 -0.426240 -0.259592 0.033832 -0.044036 0.283504 0.197458 -0.184913 -0.154220 -0.160839 -0.194991 0.254510 0.473332 -0.166537 -0.218347 0.037121 -0.122209 -0.089576 -0.151255 -0.251648 0.101598 0.065136 0.091795 0.101294 0.118289 0.108194 0.123567 0.132721 0.145162 0.132328 0.123122 0.088581 0.092874 0.125322 0.123716 0.123224 0.079479 0.080979 0.100726
qa: -0.2917 -0.3030 -0.3187 -0.4262 -0.2596 0.0338 -0.0440 0.2835 0.1975 -0.1849 -0.1542 -0.1608 -0.1950 0.2545 0.4733 -0.1665 -0.2183 0.0371 -0.1222 -0.0896 -0.1513 -0.2516 0.1016 0.0651 0.0918 0.1013 0.1183 0.1082 0.1236 0.1327 0.1452 0.1323 0.1231 0.0886 0.0929 0.1253 0.1237 0.1232 0.0795 0.0810 0.1007
va: 2.1093 2.0997 2.0778 2.0801 3.1476 3.8161 3.9184 3.8760 3.8640 4.0142 3.8721 4.0287 4.0364 3.8113 4.3363 3.9231 4.0287 3.8979 3.9561 3.9370 3.9633 3.9032 0.9986 0.9951 1.0071 1.0234 1.0153 1.0190 1.0112 1.0042 1.0374 1.0055 1.0151 1.0105 0.9948 1.0001 0.9987 1.0009 1.0056 1.0112 1.0146
dispcorr: -0.015585923 hartree
energy: -1015.018922998783
dipole: -7.86376 7.21256 -0.65120 15.49259 -14.92796 0.56464 -1.68742 0.76937 -0.91805
magnitude: 1.25924 au
magnitude: 3.20073 debye
