program: Orca
programVersion: 5.0.2
elementType: O O O O N C C C C C C C C C C C C C C C C C H H H H H H H H H H H H H H H H H H H
charge: 0
multiplicity: 1
keywords: wb97x-d3
keywords: def2-TZVPP
keywords: def2/J RIJCOSX
keywords: DEFGRID2
keywords: scfconv7
keywords: smallprint printgap noloewdin
keywords: NOSOSCF
formula: C17H19NO4
InChI: InChI=1/C17H19NO4/c1-2-20-17(19)18-12-13-21-14-8-10-16(11-9-14)22-15-6-4-3-5-7-15/h3-11,18H,2,12-13H2,1H3
41 atoms
O  -1.558909 -0.559289 -0.766565
O  3.482406 -1.837276 1.026618
O  -5.923762 2.694166 0.76215
O  -4.169483 3.060926 -0.615378
N  -4.780215 0.96418 0.001144
C  -2.436384 0.229729 -0.000663
C  -3.759773 0.280173 -0.750421
C  -0.321983 -0.812641 -0.289534
C  2.254924 -1.479058 0.541335
C  0.192238 -0.288998 0.890136
C  0.471022 -1.668802 -1.05346
C  1.480069 -0.619444 1.296127
C  1.744241 -2.006061 -0.641245
C  4.562492 -1.854031 0.197504
C  -4.892248 2.314068 -0.003098
C  4.74441 -0.925875 -0.821475
C  5.524324 -2.826552 0.439372
C  -6.171852 4.094216 0.876671
C  5.892987 -0.984369 -1.596594
C  6.670081 -2.867511 -0.338574
C  6.859369 -1.951533 -1.363305
C  -5.283902 4.754624 1.909724
H  -2.589631 -0.205385 0.995537
H  -2.049109 1.246504 0.131409
H  -3.620221 0.770667 -1.714001
H  -4.1047 -0.734973 -0.950758
H  -0.386073 0.384285 1.507717
H  0.070479 -2.079202 -1.971136
H  1.877678 -0.20959 2.215258
H  2.338543 -2.684111 -1.240324
H  -5.425153 0.429561 0.555484
H  4.001554 -0.161297 -1.008645
H  5.368164 -3.540756 1.237197
H  -7.218685 4.164523 1.171744
H  -6.062883 4.580179 -0.094138
H  6.03332 -0.259216 -2.387422
H  7.415966 -3.627032 -0.144297
H  7.752762 -1.988923 -1.97155
H  -4.237986 4.736273 1.608378
H  -5.576973 5.798295 2.028739
H  -5.378229 4.270621 2.881881
totalener: -1015.00385920 hartree
nucrepener: 1619.38304890 hartree
electener: -2634.38690810 hartree
oneelecener: -4596.23731149 hartree
twoeener: 1961.85040339 hartree
kineticenergy: 1010.68424767 hartree
xcener: -97.186633800072 hartree
chargesum: -0.0000000
charge: -0.292512 -0.303046 -0.318405 -0.427230 -0.258038 0.035001 -0.047610 0.286233 0.204970 -0.139581 -0.206174 -0.239154 -0.119533 0.240458 0.474123 -0.158275 -0.211546 0.037204 -0.122080 -0.091369 -0.146941 -0.251226 0.069184 0.100160 0.100190 0.090680 0.108083 0.117402 0.122995 0.130542 0.146129 0.132283 0.123187 0.092797 0.088811 0.125305 0.123039 0.123524 0.098958 0.081340 0.080121
qa: -0.2925 -0.3030 -0.3184 -0.4272 -0.2580 0.0350 -0.0476 0.2862 0.2050 -0.1396 -0.2062 -0.2392 -0.1195 0.2405 0.4741 -0.1583 -0.2115 0.0372 -0.1221 -0.0914 -0.1469 -0.2512 0.0692 0.1002 0.1002 0.0907 0.1081 0.1174 0.1230 0.1305 0.1461 0.1323 0.1232 0.0928 0.0888 0.1253 0.1230 0.1235 0.0990 0.0813 0.0801
va: 2.1060 2.0949 2.0788 2.0796 3.1455 3.7891 3.9344 3.8771 3.8607 3.8532 4.0327 4.0985 3.9462 3.8165 4.3342 3.9276 4.0265 3.8970 3.9554 3.9370 3.9596 3.9058 0.9979 0.9997 1.0189 1.0087 1.0184 1.0170 1.0160 1.0020 1.0366 1.0045 1.0148 0.9944 1.0116 1.0002 0.9990 1.0007 1.0134 1.0114 1.0056
dispcorr: -0.015630713 hartree
energy: -1015.019489915634
dipole: -11.26891 10.34463 -0.92428 10.34346 -10.50500 -0.16155 2.62734 -2.19466 0.43268
magnitude: 1.03325 au
magnitude: 2.62632 debye
