program: Orca
programVersion: 5.0.2
elementType: O O O O N C C C C C C C C C C C C C C C C C H H H H H H H H H H H H H H H H H H H
charge: 0
multiplicity: 1
keywords: wb97x-d3
keywords: def2-TZVPP
keywords: def2/J RIJCOSX
keywords: DEFGRID2
keywords: scfconv7
keywords: smallprint printgap noloewdin
keywords: NOSOSCF
formula: C17H19NO4
InChI: InChI=1/C17H19NO4/c1-2-20-17(19)18-12-13-21-14-8-10-16(11-9-14)22-15-6-4-3-5-7-15/h3-11,18H,2,12-13H2,1H3
41 atoms
O  -3.282119 -1.427505 0.639128
O  2.188505 -1.968861 0.513174
O  -1.9463 2.6434 0.282097
O  -0.999099 1.310489 -1.275365
N  -3.183169 1.086511 -0.668617
C  -3.999205 -1.237192 -0.555887
C  -3.460936 -0.10172 -1.425463
C  -1.939518 -1.608376 0.567784
C  0.824105 -1.860476 0.542868
C  -1.175602 -1.041226 1.582592
C  -1.313636 -2.330716 -0.439651
C  0.199954 -1.172361 1.574134
C  0.06883 -2.446247 -0.455939
C  2.906319 -0.870348 0.140949
C  -1.94829 1.644029 -0.608532
C  4.262357 -0.885555 0.448428
C  2.349362 0.213663 -0.527544
C  -0.730392 3.366999 0.463264
C  5.059492 0.186875 0.08694
C  3.16424 1.281971 -0.877347
C  4.516144 1.280126 -0.574688
C  0.184201 2.705791 1.470934
H  -4.057385 -2.151506 -1.160107
H  -5.019338 -1.016216 -0.234833
H  -2.540687 -0.390093 -1.929997
H  -4.199394 0.092189 -2.211055
H  -1.66933 -0.48726 2.370314
H  -1.888074 -2.802025 -1.226728
H  0.794223 -0.7227 2.359463
H  0.560738 -2.988351 -1.252645
H  -3.88345 1.436068 -0.03645
H  4.680486 -1.737593 0.968393
H  1.298628 0.240931 -0.785937
H  -1.043358 4.349635 0.81686
H  -0.220824 3.500487 -0.492291
H  6.113776 0.168913 0.330545
H  2.72334 2.12124 -1.399546
H  5.141473 2.117648 -0.852765
H  -0.316225 2.572329 2.430366
H  0.534798 1.73681 1.120211
H  1.06146 3.33227 1.63576
totalener: -1014.99932339 hartree
nucrepener: 1847.56614416 hartree
electener: -2862.56546756 hartree
oneelecener: -5053.04727727 hartree
twoeener: 2190.48180971 hartree
kineticenergy: 1010.70282833 hartree
xcener: -97.194462030148 hartree
chargesum: -0.0000000
charge: -0.306548 -0.308764 -0.313388 -0.436292 -0.220291 -0.010528 -0.084501 0.255686 0.228239 -0.154447 -0.162124 -0.189578 -0.155568 0.260777 0.476106 -0.190584 -0.190115 0.033298 -0.106618 -0.185737 -0.128755 -0.236007 0.079627 0.100487 0.120322 0.102668 0.118978 0.116889 0.135022 0.121966 0.137601 0.119495 0.178782 0.094063 0.086442 0.120353 0.127644 0.120859 0.087960 0.064672 0.091907
qa: -0.3065 -0.3088 -0.3134 -0.4363 -0.2203 -0.0105 -0.0845 0.2557 0.2282 -0.1544 -0.1621 -0.1896 -0.1556 0.2608 0.4761 -0.1906 -0.1901 0.0333 -0.1066 -0.1857 -0.1288 -0.2360 0.0796 0.1005 0.1203 0.1027 0.1190 0.1169 0.1350 0.1220 0.1376 0.1195 0.1788 0.0941 0.0864 0.1204 0.1276 0.1209 0.0880 0.0647 0.0919
va: 2.0707 2.1040 2.0721 2.0579 3.1432 3.9315 3.8598 3.8331 3.8373 3.9304 3.8420 3.9668 4.0560 3.7903 4.3141 4.0158 3.8176 3.8966 3.9587 3.9855 3.9367 3.9027 0.9981 0.9932 1.0235 1.0073 1.0176 1.0053 0.9985 1.0114 1.0406 1.0161 1.0008 0.9962 1.0106 0.9991 1.0026 1.0002 1.0089 1.0044 1.0156
dispcorr: -0.022866776 hartree
energy: -1015.022190169237
dipole: -1.68270 0.49265 -1.19005 8.86349 -8.33027 0.53322 -0.20898 0.16819 -0.04079
magnitude: 1.30468 au
magnitude: 3.31624 debye
