program: Orca
programVersion: 5.0.2
elementType: O O O O N C C C C C C C C C C C C C C C C C H H H H H H H H H H H H H H H H H H H
charge: 0
multiplicity: 1
keywords: wb97x-d3
keywords: def2-TZVPP
keywords: def2/J RIJCOSX
keywords: DEFGRID2
keywords: scfconv7
keywords: smallprint printgap noloewdin
keywords: NOSOSCF
formula: C17H19NO4
InChI: InChI=1/C17H19NO4/c1-2-20-17(19)18-12-13-21-14-8-10-16(11-9-14)22-15-6-4-3-5-7-15/h3-11,18H,2,12-13H2,1H3
41 atoms
O  -3.159446 -1.978496 -0.379532
O  2.139119 -1.683835 1.090852
O  -0.756381 1.855513 -0.433075
O  -2.773096 1.992973 0.574659
N  -2.472514 0.764625 -1.307981
C  -4.022587 -0.868663 -0.22777
C  -3.794157 0.187964 -1.301757
C  -1.869822 -1.865132 0.026628
C  0.82023 -1.741304 0.725064
C  -0.902512 -2.459377 -0.779432
C  -1.479966 -1.233025 1.203374
C  0.435634 -2.403862 -0.430907
C  -0.136833 -1.162533 1.540209
C  2.974401 -0.846289 0.418235
C  -2.058607 1.575809 -0.30554
C  2.538454 0.118856 -0.482315
C  4.331832 -0.986968 0.689648
C  -0.157106 2.659843 0.583094
C  3.472304 0.936878 -1.105105
C  5.247439 -0.161506 0.061433
C  4.825778 0.804754 -0.842636
C  -0.380711 4.139427 0.356565
H  -5.035671 -1.261105 -0.329269
H  -3.951965 -0.41864 0.764625
H  -3.962868 -0.24962 -2.286251
H  -4.538304 0.976366 -1.172201
H  -1.210287 -2.970401 -1.682665
H  -2.206149 -0.779203 1.863692
H  1.182431 -2.867678 -1.062617
H  0.1673 -0.660193 2.449331
H  -1.770872 0.350473 -1.897243
H  1.485982 0.243833 -0.699661
H  4.656743 -1.742654 1.39279
H  0.904658 2.418553 0.534254
H  -0.522968 2.358984 1.566031
H  3.126859 1.686768 -1.805009
H  6.301187 -0.27827 0.278431
H  5.544645 1.445932 -1.334236
H  0.175966 4.708156 1.102364
H  -0.026545 4.4474 -0.627202
H  -1.431846 4.405825 0.450106
totalener: -1015.00112978 hartree
nucrepener: 1833.89105053 hartree
electener: -2848.89218031 hartree
oneelecener: -5025.13865076 hartree
twoeener: 2176.24647045 hartree
kineticenergy: 1010.69307664 hartree
xcener: -97.191305673088 hartree
chargesum: -0.0000000
charge: -0.312190 -0.304063 -0.312239 -0.421790 -0.219559 0.009769 -0.044404 0.181882 0.241474 -0.195322 -0.068935 -0.123011 -0.251807 0.298119 0.424927 -0.215144 -0.206863 0.051642 -0.149900 -0.093120 -0.145870 -0.249500 0.098230 0.099797 0.093107 0.092241 0.124932 0.127572 0.128850 0.126055 0.150649 0.130862 0.122075 0.090353 0.085502 0.126257 0.122818 0.123107 0.084060 0.079017 0.100423
qa: -0.3122 -0.3041 -0.3122 -0.4218 -0.2196 0.0098 -0.0444 0.1819 0.2415 -0.1953 -0.0689 -0.1230 -0.2518 0.2981 0.4249 -0.2151 -0.2069 0.0516 -0.1499 -0.0931 -0.1459 -0.2495 0.0982 0.0998 0.0931 0.0922 0.1249 0.1276 0.1288 0.1261 0.1506 0.1309 0.1221 0.0904 0.0855 0.1263 0.1228 0.1231 0.0841 0.0790 0.1004
va: 2.0697 2.1085 2.0631 2.0851 3.1651 3.8465 3.9127 3.8974 3.7968 3.9867 3.7160 3.9867 4.0162 3.7631 4.3968 3.8836 4.0234 3.8490 3.9818 3.9483 3.9585 3.9458 1.0055 1.0046 1.0047 1.0189 1.0148 1.0105 1.0026 1.0118 1.0325 1.0161 1.0161 0.9920 1.0132 1.0009 0.9986 1.0005 1.0086 1.0061 1.0139
dispcorr: -0.022143075 hartree
energy: -1015.023272854307
dipole: -1.69904 1.68835 -0.01069 11.92819 -11.70621 0.22198 -2.00007 1.32054 -0.67953
magnitude: 0.71494 au
magnitude: 1.81724 debye
