program: Orca
programVersion: 5.0.2
elementType: O O O O N C C C C C C C C C C C C C C C C C H H H H H H H H H H H H H H H H H H H
charge: 0
multiplicity: 1
keywords: wb97x-d3
keywords: def2-TZVPP
keywords: def2/J RIJCOSX
keywords: DEFGRID2
keywords: scfconv7
keywords: smallprint printgap noloewdin
keywords: NOSOSCF
formula: C17H19NO4
InChI: InChI=1/C17H19NO4/c1-2-20-17(19)18-12-13-21-14-8-10-16(11-9-14)22-15-6-4-3-5-7-15/h3-11,18H,2,12-13H2,1H3
41 atoms
O  -1.389555 -0.295337 -0.734502
O  3.563121 -2.002134 0.943797
O  -5.854379 2.589136 1.219211
O  -4.172833 3.213995 -0.155113
N  -4.644018 1.026776 0.234295
C  -2.284573 0.349349 0.138794
C  -3.605963 0.486514 -0.603976
C  -0.17468 -0.663505 -0.276224
C  2.357057 -1.537719 0.496369
C  0.342398 -0.306873 0.962812
C  0.591136 -1.459919 -1.127239
C  1.608875 -0.738959 1.339752
C  1.842257 -1.89917 -0.745012
C  4.644737 -1.974652 0.116132
C  -4.831759 2.360069 0.384782
C  5.553201 -3.018757 0.231161
C  4.87767 -0.938001 -0.780555
C  -6.216685 3.949691 1.448039
C  6.696993 -3.022954 -0.551068
C  6.022876 -0.960075 -1.562298
C  6.93634 -1.998309 -1.455083
C  -7.107614 4.496371 0.353014
H  -2.430597 -0.238345 1.054668
H  -1.919829 1.34139 0.429926
H  -3.474856 1.123722 -1.478334
H  -3.925424 -0.493458 -0.961751
H  -0.215837 0.316215 1.648043
H  0.186157 -1.742911 -2.090033
H  2.010579 -0.456786 2.304041
H  2.414823 -2.529824 -1.412999
H  -5.236008 0.398535 0.748366
H  5.358126 -3.817624 0.934431
H  4.176111 -0.118405 -0.86804
H  -5.324209 4.566598 1.564434
H  -6.744348 3.938424 2.401738
H  7.401052 -3.839223 -0.456577
H  6.20224 -0.151388 -2.258566
H  7.827336 -2.007163 -2.06797
H  -7.43608 5.502287 0.617129
H  -6.579678 4.558152 -0.597063
H  -7.997062 3.880295 0.221104
totalener: -1015.00363999 hartree
nucrepener: 1612.25720751 hartree
electener: -2627.26084750 hartree
oneelecener: -4581.97805697 hartree
twoeener: 1954.71720947 hartree
kineticenergy: 1010.68575978 hartree
xcener: -97.186674841361 hartree
chargesum: -0.0000000
charge: -0.293116 -0.303194 -0.318695 -0.426391 -0.257787 0.034638 -0.045212 0.278576 0.203875 -0.139120 -0.202716 -0.236647 -0.120520 0.235970 0.471358 -0.208158 -0.155890 0.037130 -0.093637 -0.122517 -0.145523 -0.249364 0.069073 0.098429 0.100447 0.091028 0.109741 0.118413 0.123920 0.131056 0.145777 0.123346 0.132494 0.087826 0.092516 0.123216 0.125657 0.123679 0.080492 0.099387 0.080444
qa: -0.2931 -0.3032 -0.3187 -0.4264 -0.2578 0.0346 -0.0452 0.2786 0.2039 -0.1391 -0.2027 -0.2366 -0.1205 0.2360 0.4714 -0.2082 -0.1559 0.0371 -0.0936 -0.1225 -0.1455 -0.2494 0.0691 0.0984 0.1004 0.0910 0.1097 0.1184 0.1239 0.1311 0.1458 0.1233 0.1325 0.0878 0.0925 0.1232 0.1257 0.1237 0.0805 0.0994 0.0804
va: 2.1047 2.0947 2.0774 2.0809 3.1431 3.8052 3.9263 3.8826 3.8618 3.8545 4.0304 4.0945 3.9448 3.8192 4.3385 4.0254 3.9264 3.8958 3.9373 3.9559 3.9577 3.9065 0.9989 0.9983 1.0206 1.0091 1.0175 1.0166 1.0156 1.0018 1.0367 1.0145 1.0044 1.0125 0.9944 0.9991 1.0002 1.0006 1.0111 1.0139 1.0059
dispcorr: -0.015568602 hartree
energy: -1015.019208589239
dipole: -14.91877 13.98834 -0.93043 9.76338 -10.03371 -0.27033 -0.45640 0.79074 0.33434
magnitude: 1.02497 au
magnitude: 2.60526 debye
