program: Orca
programVersion: 5.0.2
elementType: O O O O N C C C C C C C C C C C C C C C C C H H H H H H H H H H H H H H H H H H H
charge: 0
multiplicity: 1
keywords: wb97x-d3
keywords: def2-TZVPP
keywords: def2/J RIJCOSX
keywords: DEFGRID2
keywords: scfconv7
keywords: smallprint printgap noloewdin
keywords: NOSOSCF
formula: C17H19NO4
InChI: InChI=1/C17H19NO4/c1-2-20-17(19)18-12-13-21-14-8-10-16(11-9-14)22-15-6-4-3-5-7-15/h3-11,18H,2,12-13H2,1H3
41 atoms
O  -1.641882 -0.259631 1.079302
O  3.197126 -1.104765 -1.401221
O  -4.490845 3.127042 0.197627
O  -5.560617 1.155388 0.43564
N  -3.514301 1.284328 -0.541738
C  -2.854158 -0.80515 0.60665
C  -3.338757 -0.137279 -0.674195
C  -0.4875 -0.523898 0.431581
C  2.003193 -0.927572 -0.757476
C  -0.324993 -1.495579 -0.55001
C  0.615257 0.243167 0.811522
C  0.920049 -1.69699 -1.134188
C  1.848082 0.046979 0.222369
C  4.293865 -1.488331 -0.691142
C  -4.607214 1.800071 0.07085
C  5.527385 -1.250696 -1.287048
C  4.224995 -2.115475 0.547174
C  -5.577293 3.809296 0.820253
C  6.68826 -1.641515 -0.642313
C  5.399013 -2.495394 1.182743
C  6.633328 -2.262103 0.598255
C  -5.205725 5.270312 0.91878
H  -2.785736 -1.890384 0.466491
H  -3.580601 -0.631814 1.400081
H  -2.643231 -0.312159 -1.496323
H  -4.286905 -0.593154 -0.962321
H  -1.147234 -2.119348 -0.872232
H  0.490616 1.000673 1.574302
H  1.041235 -2.455397 -1.896427
H  2.691878 0.655286 0.522609
H  -2.721091 1.884264 -0.688444
H  5.566024 -0.763005 -2.25227
H  3.270246 -2.3144 1.015602
H  -5.768156 3.389449 1.810514
H  -6.48878 3.678466 0.232161
H  7.644335 -1.452225 -1.112504
H  5.339678 -2.985177 2.145891
H  7.542326 -2.562195 1.101381
H  -4.308676 5.415308 1.520293
H  -5.034088 5.70849 -0.0640
H  -6.017631 5.821672 1.392633
totalener: -1015.00332474 hartree
nucrepener: 1653.84506787 hartree
electener: -2668.84839261 hartree
oneelecener: -4664.93270247 hartree
twoeener: 1996.08430986 hartree
kineticenergy: 1010.69303404 hartree
xcener: -97.188769620719 hartree
chargesum: -0.0000000
charge: -0.298467 -0.301322 -0.312279 -0.428837 -0.235052 0.010912 -0.093513 0.273142 0.183238 -0.179033 -0.190418 -0.203308 -0.118770 0.255719 0.469117 -0.214257 -0.163250 0.042484 -0.090397 -0.130754 -0.150898 -0.233445 0.085073 0.123008 0.117005 0.104271 0.112697 0.122662 0.125394 0.133336 0.147037 0.122232 0.129629 0.085873 0.085616 0.123573 0.124897 0.123501 0.082371 0.083683 0.077531
qa: -0.2985 -0.3013 -0.3123 -0.4288 -0.2351 0.0109 -0.0935 0.2731 0.1832 -0.1790 -0.1904 -0.2033 -0.1188 0.2557 0.4691 -0.2143 -0.1633 0.0425 -0.0904 -0.1308 -0.1509 -0.2334 0.0851 0.1230 0.1170 0.1043 0.1127 0.1227 0.1254 0.1333 0.1470 0.1222 0.1296 0.0859 0.0856 0.1236 0.1249 0.1235 0.0824 0.0837 0.0775
va: 2.0892 2.0958 2.0789 2.0846 3.1342 3.8172 3.9127 3.8632 3.8800 3.8403 4.0093 4.0740 3.9747 3.8053 4.3467 4.0240 3.9126 3.8779 3.9436 3.9705 3.9623 3.9579 1.0029 1.0104 0.9988 1.0254 1.0138 1.0166 1.0139 1.0008 1.0366 1.0155 1.0077 1.0005 0.9985 0.9986 1.0004 1.0008 1.0054 1.0046 1.0090
dispcorr: -0.016399010 hartree
energy: -1015.019723750336
dipole: -10.22270 10.45901 0.23631 8.57545 -8.27455 0.30089 3.18908 -3.24028 -0.05120
magnitude: 0.38600 au
magnitude: 0.98114 debye
