program: Orca
programVersion: 5.0.2
elementType: O O O O N C C C C C C C C C C C C C C C C C H H H H H H H H H H H H H H H H H H H
charge: 0
multiplicity: 1
keywords: wb97x-d3
keywords: def2-TZVPP
keywords: def2/J RIJCOSX
keywords: DEFGRID2
keywords: scfconv7
keywords: smallprint printgap noloewdin
keywords: NOSOSCF
formula: C17H19NO4
InChI: InChI=1/C17H19NO4/c1-2-20-17(19)18-12-13-21-14-8-10-16(11-9-14)22-15-6-4-3-5-7-15/h3-11,18H,2,12-13H2,1H3
41 atoms
O  -2.51173 -1.726961 0.05979
O  2.882673 -2.466956 0.850788
O  -3.893335 3.741378 -0.006558
O  -1.983972 2.615094 0.404279
N  -3.680769 1.679259 -0.778407
C  -3.162672 -0.494416 0.246466
C  -3.026278 0.411237 -0.976947
C  -1.174216 -1.813291 0.249864
C  1.554396 -2.224248 0.620445
C  -0.618226 -3.077921 0.071094
C  -0.349873 -0.751145 0.612999
C  0.73781 -3.281007 0.247199
C  1.008414 -0.965025 0.802231
C  3.821929 -1.814716 0.114097
C  -3.088689 2.67664 -0.080692
C  5.09502 -1.73469 0.667186
C  3.5709 -1.274175 -1.141669
C  -3.40245 4.868406 0.719497
C  6.112666 -1.113098 -0.035965
C  4.600531 -0.64874 -1.830363
C  5.872429 -0.561658 -1.286984
C  -4.493821 5.911796 0.739479
H  -4.215169 -0.734124 0.408344
H  -2.807549 0.020598 1.144554
H  -1.976218 0.578051 -1.219002
H  -3.474862 -0.076208 -1.843135
H  -1.261163 -3.901506 -0.210359
H  -0.731806 0.252048 0.751373
H  1.164851 -4.265072 0.105563
H  1.639974 -0.134824 1.091704
H  -4.617642 1.814009 -1.114105
H  5.275793 -2.161822 1.644948
H  2.585658 -1.337274 -1.583861
H  -2.500008 5.256855 0.241146
H  -3.130125 4.571262 1.734781
H  7.100309 -1.054184 0.40223
H  4.39944 -0.228158 -2.807097
H  6.667709 -0.070853 -1.831229
H  -4.155104 6.781105 1.303108
H  -4.750852 6.245389 -0.265622
H  -5.397745 5.535235 1.21815
totalener: -1015.00397886 hartree
nucrepener: 1669.20799717 hartree
electener: -2684.21197603 hartree
oneelecener: -4696.09105355 hartree
twoeener: 2011.87907752 hartree
kineticenergy: 1010.68790700 hartree
xcener: -97.188508517536 hartree
chargesum: 0.0000000
charge: -0.299017 -0.303070 -0.312009 -0.436650 -0.246929 0.021819 -0.092062 0.271751 0.186117 -0.189109 -0.159095 -0.151854 -0.205727 0.249555 0.481460 -0.210753 -0.155041 0.042907 -0.091728 -0.129398 -0.151387 -0.231522 0.097798 0.098699 0.119326 0.099294 0.115893 0.145033 0.122087 0.134360 0.146757 0.121825 0.126828 0.087300 0.085694 0.121579 0.123300 0.121370 0.079607 0.083273 0.081720
qa: -0.2990 -0.3031 -0.3120 -0.4366 -0.2469 0.0218 -0.0921 0.2718 0.1861 -0.1891 -0.1591 -0.1519 -0.2057 0.2496 0.4815 -0.2108 -0.1550 0.0429 -0.0917 -0.1294 -0.1514 -0.2315 0.0978 0.0987 0.1193 0.0993 0.1159 0.1450 0.1221 0.1344 0.1468 0.1218 0.1268 0.0873 0.0857 0.1216 0.1233 0.1214 0.0796 0.0833 0.0817
va: 2.1066 2.0960 2.0788 2.0624 3.1381 3.8210 3.8380 3.8343 3.8557 4.0275 3.8127 4.0311 4.0567 3.8192 4.3131 4.0213 3.9097 3.8736 3.9445 3.9667 3.9612 3.9574 1.0027 1.0114 1.0085 1.0112 1.0166 1.0214 1.0102 1.0051 1.0365 1.0154 1.0088 0.9992 1.0010 0.9990 1.0005 1.0012 1.0091 1.0047 1.0054
dispcorr: -0.016552763 hartree
energy: -1015.020531618468
dipole: -10.06735 8.64131 -1.42604 15.79910 -14.86684 0.93226 -1.12114 0.63111 -0.49003
magnitude: 1.77281 au
magnitude: 4.50611 debye
