program: Orca
programVersion: 5.0.2
elementType: O O O O N C C C C C C C C C C C C C C C C C H H H H H H H H H H H H H H H H H H H
charge: 0
multiplicity: 1
keywords: wb97x-d3
keywords: def2-TZVPP
keywords: def2/J RIJCOSX
keywords: DEFGRID2
keywords: scfconv7
keywords: smallprint printgap noloewdin
keywords: NOSOSCF
formula: C17H19NO4
InChI: InChI=1/C17H19NO4/c1-2-20-17(19)18-12-13-21-14-8-10-16(11-9-14)22-15-6-4-3-5-7-15/h3-11,18H,2,12-13H2,1H3
41 atoms
O  -2.376104 -1.694012 0.912663
O  2.733232 -2.548427 -0.949985
O  -3.997779 3.636118 0.110492
O  -2.078453 2.498406 -0.209823
N  -4.079875 1.433414 -0.09654
C  -2.946569 -0.416921 1.059083
C  -3.532984 0.108343 -0.251598
C  -1.111445 -1.809862 0.440329
C  1.484395 -2.269407 -0.464116
C  -0.581472 -3.097834 0.433148
C  -0.331049 -0.7518 -0.017379
C  0.708614 -3.325621 -0.008996
C  0.959238 -0.98788 -0.472023
C  3.79692 -1.799658 -0.549541
C  -3.279362 2.524632 -0.076432
C  3.896965 -1.24692 0.722373
C  4.829487 -1.638452 -1.464893
C  -3.273987 4.866703 0.14149
C  5.032082 -0.527135 1.063452
C  5.960283 -0.922551 -1.106786
C  6.06673 -0.357503 0.155814
C  -4.268381 5.981047 0.365143
H  -3.745568 -0.527387 1.79476
H  -2.228195 0.301134 1.467251
H  -2.778004 0.116044 -1.038723
H  -4.329865 -0.554969 -0.589161
H  -1.187442 -3.920681 0.789028
H  -0.70114 0.264866 -0.046291
H  1.117017 -4.327693 -0.006112
H  1.549002 -0.15594 -0.835118
H  -5.065437 1.551574 0.057837
H  3.09968 -1.375829 1.442571
H  4.738592 -2.077031 -2.449978
H  -2.736479 5.007769 -0.798847
H  -2.529466 4.84342 0.940418
H  5.105568 -0.098739 2.054449
H  6.75954 -0.799395 -1.825875
H  6.947259 0.207219 0.430344
H  -3.742764 6.935216 0.395964
H  -5.00301 6.031096 -0.438038
H  -4.798953 5.862327 1.309453
totalener: -1015.00385406 hartree
nucrepener: 1667.86389048 hartree
electener: -2682.86774454 hartree
oneelecener: -4693.47209755 hartree
twoeener: 2010.60435300 hartree
kineticenergy: 1010.67960636 hartree
xcener: -97.187470572098 hartree
chargesum: -0.0000000
charge: -0.300355 -0.304568 -0.311801 -0.439297 -0.245958 0.021254 -0.093760 0.252083 0.207596 -0.175616 -0.141454 -0.172403 -0.225975 0.244907 0.483709 -0.155594 -0.211996 0.042954 -0.121723 -0.092014 -0.149901 -0.231471 0.097696 0.097735 0.120045 0.100181 0.115626 0.149578 0.121417 0.134134 0.146499 0.129610 0.122418 0.086974 0.086321 0.123936 0.122063 0.122534 0.079255 0.083291 0.082068
qa: -0.3004 -0.3046 -0.3118 -0.4393 -0.2460 0.0213 -0.0938 0.2521 0.2076 -0.1756 -0.1415 -0.1724 -0.2260 0.2449 0.4837 -0.1556 -0.2120 0.0430 -0.1217 -0.0920 -0.1499 -0.2315 0.0977 0.0977 0.1200 0.1002 0.1156 0.1496 0.1214 0.1341 0.1465 0.1296 0.1224 0.0870 0.0863 0.1239 0.1221 0.1225 0.0793 0.0833 0.0821
va: 2.1044 2.0968 2.0802 2.0577 3.1394 3.8194 3.8373 3.8604 3.8362 4.0249 3.7976 4.0419 4.0421 3.8213 4.3085 3.9204 4.0277 3.8730 3.9554 3.9396 3.9606 3.9571 1.0024 1.0134 1.0078 1.0107 1.0162 1.0213 1.0115 1.0060 1.0365 1.0062 1.0149 1.0000 1.0004 1.0003 0.9990 1.0009 1.0090 1.0048 1.0051
dispcorr: -0.016519185 hartree
energy: -1015.020373248623
dipole: -9.21428 7.86090 -1.35338 16.27066 -15.30996 0.96070 2.56062 -2.23528 0.32534
magnitude: 1.69128 au
magnitude: 4.29890 debye
