program: Orca
programVersion: 5.0.2
elementType: O O O O N C C C C C C C C C C C C C C C C C H H H H H H H H H H H H H H H H H H H
charge: 0
multiplicity: 1
keywords: wb97x-d3
keywords: def2-TZVPP
keywords: def2/J RIJCOSX
keywords: DEFGRID2
keywords: scfconv7
keywords: smallprint printgap noloewdin
keywords: NOSOSCF
formula: C17H19NO4
InChI: InChI=1/C17H19NO4/c1-2-20-17(19)18-12-13-21-14-8-10-16(11-9-14)22-15-6-4-3-5-7-15/h3-11,18H,2,12-13H2,1H3
41 atoms
O  -2.689773 -1.881756 -0.858709
O  2.439203 -1.442579 1.09758
O  -1.849211 2.562506 0.008929
O  -3.610361 1.708278 1.136868
N  -3.118453 1.043557 -0.974219
C  -3.829836 -1.252882 -0.315861
C  -4.151111 0.042457 -1.045386
C  -1.459333 -1.701972 -0.327732
C  1.170944 -1.50975 0.587141
C  -1.166465 -0.979596 0.823695
C  -0.417577 -2.3312 -1.011287
C  0.146403 -0.881057 1.268023
C  0.883851 -2.242715 -0.558353
C  3.457723 -0.986947 0.319381
C  -2.917355 1.771379 0.147779
C  4.736978 -1.406457 0.665616
C  3.272599 -0.117865 -0.749867
C  -1.521712 3.415903 1.103655
C  5.827401 -0.957246 -0.059753
C  4.375306 0.317629 -1.470669
C  5.654422 -0.097474 -1.135326
C  -2.362899 4.67436 1.121801
H  -4.659909 -1.948219 -0.460477
H  -3.744742 -1.082325 0.759004
H  -4.328506 -0.172124 -2.099997
H  -5.081404 0.446928 -0.642615
H  -1.932774 -0.476092 1.39559
H  -0.644075 -2.904873 -1.900542
H  0.368197 -0.313336 2.162214
H  1.67606 -2.747661 -1.096507
H  -2.416139 1.070721 -1.69261
H  4.865523 -2.081195 1.50181
H  2.281329 0.221817 -1.019674
H  -0.469686 3.659008 0.957909
H  -1.613961 2.87608 2.047529
H  6.820242 -1.288329 0.215318
H  4.226532 0.994515 -2.301796
H  6.508002 0.246504 -1.703205
H  -2.01999 5.331917 1.921251
H  -2.27852 5.220607 0.182558
H  -3.41231 4.450004 1.303638
totalener: -1015.00246252 hartree
nucrepener: 1750.09826945 hartree
electener: -2765.10073198 hartree
oneelecener: -4857.65377547 hartree
twoeener: 2092.55304349 hartree
kineticenergy: 1010.69528555 hartree
xcener: -97.191933797443 hartree
chargesum: -0.0000000
charge: -0.302614 -0.301880 -0.307197 -0.425622 -0.238036 0.010388 -0.040048 0.237862 0.208238 -0.117720 -0.188592 -0.226221 -0.137194 0.253358 0.434807 -0.215907 -0.163088 0.042627 -0.089573 -0.126351 -0.151719 -0.252199 0.100102 0.103268 0.092450 0.093922 0.117719 0.118369 0.122273 0.130603 0.155401 0.123100 0.127709 0.096408 0.083408 0.122695 0.123608 0.122897 0.081620 0.081578 0.099549
qa: -0.3026 -0.3019 -0.3072 -0.4256 -0.2380 0.0104 -0.0400 0.2379 0.2082 -0.1177 -0.1886 -0.2262 -0.1372 0.2534 0.4348 -0.2159 -0.1631 0.0426 -0.0896 -0.1264 -0.1517 -0.2522 0.1001 0.1033 0.0925 0.0939 0.1177 0.1184 0.1223 0.1306 0.1554 0.1231 0.1277 0.0964 0.0834 0.1227 0.1236 0.1229 0.0816 0.0816 0.0995
va: 2.0884 2.0957 2.0781 2.0769 3.1643 3.8310 3.9206 3.8789 3.8434 3.7792 4.0119 4.0860 3.9908 3.8142 4.3758 4.0267 3.9142 3.8849 3.9417 3.9610 3.9624 3.9181 1.0035 1.0024 1.0041 1.0202 1.0281 1.0165 1.0165 1.0014 1.0305 1.0154 1.0085 0.9944 1.0124 0.9988 1.0005 1.0009 1.0105 1.0057 1.0131
dispcorr: -0.018698077 hartree
energy: -1015.021160601692
dipole: -5.57083 5.44918 -0.12166 11.38315 -10.97793 0.40522 -0.44897 -0.32835 -0.77732
magnitude: 0.88500 au
magnitude: 2.24950 debye
