program: Orca
programVersion: 5.0.2
elementType: O O O O N C C C C C C C C C C C C C C C C C H H H H H H H H H H H H H H H H H H H
charge: 0
multiplicity: 1
keywords: wb97x-d3
keywords: def2-TZVPP
keywords: def2/J RIJCOSX
keywords: DEFGRID2
keywords: scfconv7
keywords: smallprint printgap noloewdin
keywords: NOSOSCF
formula: C17H19NO4
InChI: InChI=1/C17H19NO4/c1-2-20-17(19)18-12-13-21-14-8-10-16(11-9-14)22-15-6-4-3-5-7-15/h3-11,18H,2,12-13H2,1H3
41 atoms
O  -2.661159 -1.882649 -0.855159
O  2.432548 -1.400354 1.183017
O  -1.866718 2.587316 -0.099372
O  -3.633607 1.754465 1.035984
N  -3.115812 1.031256 -1.049778
C  -3.813485 -1.253626 -0.338815
C  -4.140395 0.020911 -1.101851
C  -1.44068 -1.693087 -0.305007
C  1.173264 -1.480782 0.652225
C  -1.166166 -0.936309 0.828701
C  -0.389011 -2.347177 -0.948884
C  0.138682 -0.82844 1.294552
C  0.904163 -2.248535 -0.474897
C  3.468717 -0.990584 0.402503
C  -2.930571 1.792839 0.052678
C  3.311374 -0.156209 -0.698255
C  4.736173 -1.420161 0.778233
C  -1.555471 3.474603 0.973039
C  4.429606 0.233534 -1.42125
C  5.842683 -1.016377 0.050346
C  5.697194 -0.192349 -1.056693
C  -2.414258 4.720966 0.956801
H  -4.635025 -1.960842 -0.475105
H  -3.740747 -1.056669 0.732498
H  -4.311352 -0.220325 -2.151919
H  -5.075676 0.428132 -0.713428
H  -1.941097 -0.412822 1.370292
H  -0.600909 -2.948391 -1.823409
H  0.345252 -0.233596 2.174565
H  1.703872 -2.773228 -0.98219
H  -2.404607 1.039337 -1.760024
H  2.329486 0.191697 -0.990929
H  4.843711 -2.066757 1.639199
H  -0.506624 3.728979 0.822874
H  -1.641777 2.958249 1.93073
H  4.302381 0.882948 -2.277498
H  6.826072 -1.355071 0.349031
H  6.562775 0.115359 -1.627105
H  -2.344213 5.237121 -0.000711
H  -3.459198 4.488925 1.154322
H  -2.073839 5.409457 1.730999
totalener: -1015.00245684 hartree
nucrepener: 1748.23119294 hartree
electener: -2763.23364978 hartree
oneelecener: -4853.92241341 hartree
twoeener: 2090.68876364 hartree
kineticenergy: 1010.69208034 hartree
xcener: -97.191270641327 hartree
chargesum: -0.0000000
charge: -0.302990 -0.302058 -0.307069 -0.425850 -0.238425 0.011081 -0.040393 0.239495 0.208154 -0.117593 -0.189744 -0.227694 -0.136223 0.251547 0.435346 -0.162293 -0.214863 0.042425 -0.125989 -0.090167 -0.151286 -0.252599 0.099957 0.103158 0.092613 0.093976 0.117143 0.118304 0.122319 0.130638 0.155689 0.127680 0.123292 0.096369 0.083343 0.123909 0.122584 0.123079 0.081427 0.100139 0.081564
qa: -0.3030 -0.3021 -0.3071 -0.4259 -0.2384 0.0111 -0.0404 0.2395 0.2082 -0.1176 -0.1897 -0.2277 -0.1362 0.2515 0.4353 -0.1623 -0.2149 0.0424 -0.1260 -0.0902 -0.1513 -0.2526 0.1000 0.1032 0.0926 0.0940 0.1171 0.1183 0.1223 0.1306 0.1557 0.1277 0.1233 0.0964 0.0833 0.1239 0.1226 0.1231 0.0814 0.1001 0.0816
va: 2.0878 2.0956 2.0781 2.0768 3.1642 3.8304 3.9207 3.8796 3.8443 3.7811 4.0131 4.0862 3.9884 3.8153 4.3741 3.9148 4.0264 3.8865 3.9605 3.9414 3.9623 3.9163 1.0034 1.0023 1.0040 1.0203 1.0284 1.0166 1.0165 1.0014 1.0304 1.0082 1.0153 0.9944 1.0120 1.0004 0.9989 1.0009 1.0058 1.0131 1.0105
dispcorr: -0.018653690 hartree
energy: -1015.021110533489
dipole: -5.63376 5.52751 -0.10625 11.29825 -10.92418 0.37407 -0.84946 0.05866 -0.79080
magnitude: 0.88124 au
magnitude: 2.23993 debye
