program: Orca
programVersion: 5.0.2
elementType: O O O O N C C C C C C C C C C C C C C C C C H H H H H H H H H H H H H H H H H H H
charge: 0
multiplicity: 1
keywords: wb97x-d3
keywords: def2-TZVPP
keywords: def2/J RIJCOSX
keywords: DEFGRID2
keywords: scfconv7
keywords: smallprint printgap noloewdin
keywords: NOSOSCF
formula: C17H19NO4
InChI: InChI=1/C17H19NO4/c1-2-20-17(19)18-12-13-21-14-8-10-16(11-9-14)22-15-6-4-3-5-7-15/h3-11,18H,2,12-13H2,1H3
41 atoms
O  -2.706793 -1.956223 0.581302
O  2.465819 -1.311614 -1.196562
O  -1.789598 2.544375 0.202333
O  -3.554332 1.841456 -1.020507
N  -3.088602 0.949975 1.012344
C  -3.83221 -1.251873 0.105696
C  -4.13621 -0.036982 0.969296
C  -1.465736 -1.722676 0.098267
C  1.184029 -1.435755 -0.73139
C  -0.43636 -2.405917 0.747433
C  -1.151229 -0.90007 -0.977603
C  0.874617 -2.270669 0.335915
C  0.171314 -0.755066 -1.379354
C  3.456681 -0.951339 -0.336032
C  -2.867558 1.788376 -0.026428
C  4.741778 -1.376079 -0.651822
C  3.236531 -0.167491 0.790829
C  -1.437303 3.499762 -0.796367
C  5.803123 -1.017917 0.162455
C  4.309302 0.176876 1.599932
C  5.594177 -0.245539 1.296142
C  -2.278714 4.755717 -0.717892
H  -3.739175 -0.968552 -0.944582
H  -4.674378 -1.944383 0.172259
H  -5.057485 0.423151 0.607353
H  -4.324751 -0.360959 1.993691
H  -0.679536 -3.058095 1.576061
H  -1.908068 -0.350909 -1.519635
H  1.657142 -2.817103 0.846988
H  0.409492 -0.107662 -2.213034
H  -2.3859 0.881592 1.727288
H  4.898597 -1.983224 -1.533714
H  2.240347 0.175681 1.03732
H  -1.502352 3.052427 -1.789929
H  -0.389885 3.726903 -0.599622
H  6.800601 -1.35414 -0.088582
H  4.133032 0.786314 2.476611
H  6.424101 0.025175 1.934355
H  -1.907387 5.488458 -1.435163
H  -3.32105 4.554591 -0.957556
H  -2.22677 5.205692 0.273505
totalener: -1015.00225696 hartree
nucrepener: 1753.09219150 hartree
electener: -2768.09444846 hartree
oneelecener: -4863.64146933 hartree
twoeener: 2095.54702088 hartree
kineticenergy: 1010.69438358 hartree
xcener: -97.191634213025 hartree
chargesum: -0.0000000
charge: -0.302707 -0.302705 -0.306899 -0.425722 -0.237006 0.009039 -0.040080 0.231684 0.207232 -0.187858 -0.114557 -0.133316 -0.227020 0.245455 0.433736 -0.211929 -0.157984 0.042513 -0.091854 -0.127121 -0.149312 -0.252008 0.103612 0.100148 0.094151 0.092815 0.118340 0.117156 0.130536 0.122564 0.155296 0.123427 0.128264 0.083305 0.096059 0.122904 0.123752 0.123095 0.081343 0.100319 0.081335
qa: -0.3027 -0.3027 -0.3069 -0.4257 -0.2370 0.0090 -0.0401 0.2317 0.2072 -0.1879 -0.1146 -0.1333 -0.2270 0.2455 0.4337 -0.2119 -0.1580 0.0425 -0.0919 -0.1271 -0.1493 -0.2520 0.1036 0.1001 0.0942 0.0928 0.1183 0.1172 0.1305 0.1226 0.1553 0.1234 0.1283 0.0833 0.0961 0.1229 0.1238 0.1231 0.0813 0.1003 0.0813
va: 2.0879 2.0946 2.0766 2.0769 3.1644 3.8328 3.9203 3.8792 3.8433 4.0126 3.7753 3.9850 4.0811 3.8176 4.3755 4.0247 3.9112 3.8860 3.9421 3.9608 3.9605 3.9171 1.0021 1.0035 1.0199 1.0041 1.0166 1.0277 1.0014 1.0163 1.0303 1.0151 1.0081 1.0115 0.9945 0.9989 1.0005 1.0009 1.0104 1.0135 1.0058
dispcorr: -0.018797266 hartree
energy: -1015.021054228406
dipole: -5.49441 5.38639 -0.10803 11.23896 -10.92523 0.31373 1.52869 -0.71608 0.81261
magnitude: 0.87774 au
magnitude: 2.23104 debye
