program: Orca
programVersion: 5.0.2
elementType: O O O O N C C C C C C C C C C C C C C C C C H H H H H H H H H H H H H H H H H H H
charge: 0
multiplicity: 1
keywords: wb97x-d3
keywords: def2-TZVPP
keywords: def2/J RIJCOSX
keywords: DEFGRID2
keywords: scfconv7
keywords: smallprint printgap noloewdin
keywords: NOSOSCF
formula: C17H19NO4
InChI: InChI=1/C17H19NO4/c1-2-20-17(19)18-12-13-21-14-8-10-16(11-9-14)22-15-6-4-3-5-7-15/h3-11,18H,2,12-13H2,1H3
41 atoms
O  -2.428023 -1.671104 0.503349
O  2.77208 -2.242236 -1.197848
O  -3.979837 3.748997 0.396703
O  -2.162756 2.610865 -0.312391
N  -3.546954 1.767824 1.275052
C  -3.163463 -0.481117 0.360937
C  -2.818717 0.536619 1.448228
C  -1.147601 -1.722157 0.069026
C  1.485836 -2.053946 -0.763242
C  -0.490381 -2.934153 0.269578
C  -0.474876 -0.674236 -0.554651
C  0.820473 -3.097354 -0.13755
C  0.838052 -0.849374 -0.970225
C  3.794097 -1.665362 -0.511305
C  -3.145089 2.705279 0.385775
C  3.646593 -1.064276 0.733017
C  5.045326 -1.716211 -1.117912
C  -3.702376 4.819423 -0.506342
C  4.757052 -0.512971 1.357622
C  6.141661 -1.16466 -0.479501
C  6.006373 -0.556369 0.761547
C  -4.179715 4.528655 -1.912897
H  -3.03182 -0.037717 -0.631102
H  -4.21313 -0.767389 0.447619
H  -3.067468 0.124565 2.426742
H  -1.747939 0.744384 1.457812
H  -1.018474 -3.7469 0.75081
H  -0.938164 0.289805 -0.71923
H  1.327566 -4.039843 0.022318
H  1.356858 -0.032154 -1.454687
H  -4.386642 1.928314 1.802482
H  2.680936 -1.022073 1.218197
H  5.145374 -2.188812 -2.086301
H  -2.63688 5.054593 -0.499638
H  -4.237069 5.672682 -0.089776
H  4.635257 -0.045989 2.326272
H  7.110583 -1.208251 -0.959507
H  6.865131 -0.123416 1.256075
H  -5.24058 4.278782 -1.92746
H  -4.038563 5.413248 -2.534861
H  -3.620315 3.712205 -2.365837
totalener: -1015.00380405 hartree
nucrepener: 1681.88433632 hartree
electener: -2696.88814038 hartree
oneelecener: -4721.43596703 hartree
twoeener: 2024.54782665 hartree
kineticenergy: 1010.69434469 hartree
xcener: -97.190661472858 hartree
chargesum: -0.0000000
charge: -0.298230 -0.302395 -0.316008 -0.446283 -0.246848 0.021860 -0.093928 0.279615 0.170895 -0.200383 -0.170406 -0.128245 -0.194505 0.267407 0.492475 -0.162865 -0.211001 0.041299 -0.136745 -0.091015 -0.152747 -0.254368 0.096881 0.098689 0.099718 0.120495 0.116075 0.146960 0.121516 0.131018 0.147260 0.124154 0.120235 0.089150 0.093907 0.122517 0.121012 0.120351 0.080742 0.082331 0.099411
qa: -0.2982 -0.3024 -0.3160 -0.4463 -0.2468 0.0219 -0.0939 0.2796 0.1709 -0.2004 -0.1704 -0.1282 -0.1945 0.2674 0.4925 -0.1629 -0.2110 0.0413 -0.1367 -0.0910 -0.1527 -0.2544 0.0969 0.0987 0.0997 0.1205 0.1161 0.1470 0.1215 0.1310 0.1473 0.1242 0.1202 0.0891 0.0939 0.1225 0.1210 0.1204 0.0807 0.0823 0.0994
va: 2.1084 2.0996 2.0852 2.0466 3.1441 3.8206 3.8406 3.8239 3.8690 4.0293 3.8077 4.0150 4.0638 3.8103 4.2998 3.9075 4.0225 3.8882 3.9747 3.9463 3.9627 3.9083 1.0112 1.0025 1.0106 1.0082 1.0171 1.0205 1.0086 1.0070 1.0367 1.0122 1.0163 1.0116 0.9944 1.0006 0.9989 1.0013 1.0056 1.0111 1.0138
dispcorr: -0.017004934 hartree
energy: -1015.020808988729
dipole: -9.16632 7.79736 -1.36896 12.76273 -11.90551 0.85721 -0.73497 1.40244 0.66747
magnitude: 1.74767 au
magnitude: 4.44224 debye
