program: Orca
programVersion: 5.0.2
elementType: O O O O N C C C C C C C C C C C C C C C C C H H H H H H H H H H H H H H H H H H H
charge: 0
multiplicity: 1
keywords: wb97x-d3
keywords: def2-TZVPP
keywords: def2/J RIJCOSX
keywords: DEFGRID2
keywords: scfconv7
keywords: smallprint printgap noloewdin
keywords: NOSOSCF
formula: C17H19NO4
InChI: InChI=1/C17H19NO4/c1-2-20-17(19)18-12-13-21-14-8-10-16(11-9-14)22-15-6-4-3-5-7-15/h3-11,18H,2,12-13H2,1H3
41 atoms
O  -1.983249 -1.696792 0.612127
O  3.020187 -0.958846 -1.555684
O  -5.077416 3.026514 0.381596
O  -2.897723 2.540342 0.044793
N  -4.499257 0.935663 -0.042987
C  -2.86241 -0.637306 0.900914
C  -3.594942 -0.144524 -0.34707
C  -0.764362 -1.432147 0.086962
C  1.788888 -1.126846 -0.978759
C  0.044919 -2.544913 -0.144068
C  -0.283452 -0.163783 -0.220571
C  1.30979 -2.396119 -0.676606
C  0.996293 -0.020471 -0.745585
C  4.137073 -1.271627 -0.844924
C  -4.055796 2.20308 0.124111
C  4.156483 -1.397702 0.539495
C  5.307379 -1.440942 -1.577752
C  -4.768103 4.400748 0.613548
C  5.351575 -1.698616 1.178636
C  6.491093 -1.73656 -0.923915
C  6.521891 -1.872074 0.457658
C  -4.304442 4.656039 2.031425
H  -3.586701 -1.037024 1.613017
H  -2.348381 0.19353 1.394761
H  -2.885982 0.174407 -1.112368
H  -4.172282 -0.963752 -0.776978
H  -0.333941 -3.530216 0.094137
H  -0.878049 0.728222 -0.070516
H  1.926199 -3.267256 -0.858982
H  1.369102 0.966558 -0.985746
H  -5.481244 0.750238 0.05781
H  3.254265 -1.260583 1.120495
H  5.278646 -1.337863 -2.654775
H  -5.700661 4.928399 0.414741
H  -4.024884 4.748735 -0.105453
H  5.36029 -1.795553 2.256674
H  7.396775 -1.867868 -1.501729
H  7.447811 -2.107977 0.964699
H  -4.176246 5.728016 2.185495
H  -5.03556 4.301891 2.758277
H  -3.348399 4.176136 2.233139
totalener: -1015.00386275 hartree
nucrepener: 1664.53864410 hartree
electener: -2679.54250685 hartree
oneelecener: -4686.76257323 hartree
twoeener: 2007.22006638 hartree
kineticenergy: 1010.67760230 hartree
xcener: -97.187450139076 hartree
chargesum: -0.0000000
charge: -0.298237 -0.301009 -0.316139 -0.446171 -0.245770 0.023138 -0.096290 0.275158 0.185696 -0.201486 -0.155485 -0.122176 -0.230822 0.253541 0.492954 -0.159220 -0.210821 0.042367 -0.133482 -0.092196 -0.151798 -0.254199 0.096810 0.098353 0.120683 0.099556 0.117311 0.147390 0.129237 0.125675 0.147116 0.127984 0.121500 0.094061 0.087955 0.123569 0.121354 0.122046 0.082049 0.080678 0.099121
qa: -0.2982 -0.3010 -0.3161 -0.4462 -0.2458 0.0231 -0.0963 0.2752 0.1857 -0.2015 -0.1555 -0.1222 -0.2308 0.2535 0.4930 -0.1592 -0.2108 0.0424 -0.1335 -0.0922 -0.1518 -0.2542 0.0968 0.0984 0.1207 0.0996 0.1173 0.1474 0.1292 0.1257 0.1471 0.1280 0.1215 0.0941 0.0880 0.1236 0.1214 0.1220 0.0820 0.0807 0.0991
va: 2.1073 2.0966 2.0851 2.0468 3.1408 3.8132 3.8461 3.8410 3.8560 4.0298 3.7957 3.9921 4.0966 3.8167 4.2980 3.9072 4.0201 3.8873 3.9704 3.9463 3.9610 3.9096 1.0036 1.0125 1.0069 1.0110 1.0174 1.0180 1.0021 1.0149 1.0369 1.0089 1.0156 0.9943 1.0127 1.0005 0.9989 1.0008 1.0111 1.0056 1.0137
dispcorr: -0.016859901 hartree
energy: -1015.020722648758
dipole: -9.55833 8.04959 -1.50875 9.59697 -9.39418 0.20279 7.06630 -6.58874 0.47756
magnitude: 1.59547 au
magnitude: 4.05535 debye
