program: Orca
programVersion: 5.0.2
elementType: O O O O N C C C C C C C C C C C C C C C C C H H H H H H H H H H H H H H H H H H H
charge: 0
multiplicity: 1
keywords: wb97x-d3
keywords: def2-TZVPP
keywords: def2/J RIJCOSX
keywords: DEFGRID2
keywords: scfconv7
keywords: smallprint printgap noloewdin
keywords: NOSOSCF
formula: C17H19NO4
InChI: InChI=1/C17H19NO4/c1-2-20-17(19)18-12-13-21-14-8-10-16(11-9-14)22-15-6-4-3-5-7-15/h3-11,18H,2,12-13H2,1H3
41 atoms
O  -2.742995 -2.01711 -0.633475
O  2.360443 -1.276479 1.301104
O  -1.649068 2.456714 -0.252402
O  -3.551438 1.837854 0.796583
N  -2.932035 0.912111 -1.178515
C  -3.865433 -1.230986 -0.29874
C  -4.016511 -0.034653 -1.227711
C  -1.519401 -1.757251 -0.11794
C  1.097109 -1.423229 0.794384
C  -0.45629 -2.405638 -0.746793
C  -1.256199 -0.94563 0.980283
C  0.839031 -2.248018 -0.293769
C  0.049781 -0.775535 1.422454
C  3.372481 -0.893718 0.475354
C  -2.775112 1.748093 -0.126131
C  3.176715 -0.094081 -0.645142
C  4.651795 -1.311323 0.821641
C  -1.326347 3.366436 0.797649
C  4.269108 0.274832 -1.416465
C  5.732969 -0.928409 0.045316
C  5.549133 -0.138252 -1.080453
C  -2.0662 4.681161 0.674782
H  -4.734018 -1.880071 -0.426906
H  -3.861229 -0.912803 0.745625
H  -4.097266 -0.386835 -2.256799
H  -4.954855 0.470671 -0.991121
H  -0.660207 -3.048939 -1.592833
H  -2.042655 -0.423798 1.507261
H  1.648863 -2.767992 -0.789741
H  0.249082 -0.137185 2.273263
H  -2.166809 0.808428 -1.822016
H  2.184242 0.242641 -0.914942
H  4.788545 -1.931956 1.697524
H  -0.251597 3.521209 0.704868
H  -1.516255 2.906732 1.769272
H  4.112835 0.898088 -2.287328
H  6.726424 -1.257455 0.320628
H  6.394877 0.15291 -1.688289
H  -1.893611 5.143692 -0.297114
H  -3.137681 4.55226 0.81612
H  -1.709503 5.372371 1.439238
totalener: -1015.00182367 hartree
nucrepener: 1763.36259321 hartree
electener: -2778.36441687 hartree
oneelecener: -4884.16949312 hartree
twoeener: 2105.80507625 hartree
kineticenergy: 1010.68869647 hartree
xcener: -97.190490789087 hartree
chargesum: 0.0000000
charge: -0.302955 -0.302824 -0.307336 -0.424380 -0.236141 0.006767 -0.039510 0.210042 0.213448 -0.179901 -0.102506 -0.135623 -0.228402 0.243953 0.431497 -0.156620 -0.211040 0.042406 -0.127013 -0.091970 -0.148944 -0.251314 0.100251 0.103749 0.092442 0.094285 0.118633 0.118305 0.130297 0.122424 0.155375 0.126768 0.123640 0.096243 0.082473 0.123968 0.123042 0.123330 0.081380 0.100197 0.081568
qa: -0.3030 -0.3028 -0.3073 -0.4244 -0.2361 0.0068 -0.0395 0.2100 0.2134 -0.1799 -0.1025 -0.1356 -0.2284 0.2440 0.4315 -0.1566 -0.2110 0.0424 -0.1270 -0.0920 -0.1489 -0.2513 0.1003 0.1037 0.0924 0.0943 0.1186 0.1183 0.1303 0.1224 0.1554 0.1268 0.1236 0.0962 0.0825 0.1240 0.1230 0.1233 0.0814 0.1002 0.0816
va: 2.0875 2.0943 2.0734 2.0786 3.1631 3.8374 3.9183 3.8863 3.8335 4.0084 3.7608 3.9834 4.0728 3.8179 4.3805 3.9113 4.0251 3.8824 3.9602 3.9424 3.9605 3.9230 1.0036 1.0023 1.0044 1.0190 1.0166 1.0255 1.0016 1.0162 1.0295 1.0094 1.0150 0.9940 1.0117 1.0004 0.9989 1.0008 1.0059 1.0134 1.0101
dispcorr: -0.019147735 hartree
energy: -1015.020971400654
dipole: -4.84907 4.84939 0.00033 11.19018 -10.88892 0.30127 -1.77654 0.97357 -0.80297
magnitude: 0.85763 au
magnitude: 2.17992 debye
