program: Orca
programVersion: 5.0.2
elementType: O O O O N C C C C C C C C C C C C C C C C C H H H H H H H H H H H H H H H H H H H
charge: 0
multiplicity: 1
keywords: wb97x-d3
keywords: def2-TZVPP
keywords: def2/J RIJCOSX
keywords: DEFGRID2
keywords: scfconv7
keywords: smallprint printgap noloewdin
keywords: NOSOSCF
formula: C17H19NO4
InChI: InChI=1/C17H19NO4/c1-2-20-17(19)18-12-13-21-14-8-10-16(11-9-14)22-15-6-4-3-5-7-15/h3-11,18H,2,12-13H2,1H3
41 atoms
O  -2.565351 -1.847637 0.041153
O  2.843882 -2.391608 0.887649
O  -4.152814 3.568342 0.002666
O  -2.196974 2.517645 0.415887
N  -3.853246 1.520903 -0.773235
C  -3.264994 -0.643097 0.232225
C  -3.14841 0.281462 -0.978983
C  -1.227572 -1.884213 0.246112
C  1.511225 -2.192817 0.64331
C  -0.621938 -3.125755 0.067577
C  -0.447869 -0.793429 0.62263
C  0.738936 -3.277961 0.256777
C  0.915467 -0.956357 0.826026
C  3.771082 -1.662953 0.210132
C  -3.302536 2.539079 -0.072156
C  3.530634 -1.078625 -1.028026
C  5.022792 -1.549525 0.804368
C  -3.699911 4.74434 0.673049
C  4.548835 -0.377861 -1.658224
C  6.030244 -0.853444 0.158584
C  5.799851 -0.258144 -1.073743
C  -2.808683 5.600963 -0.200065
H  -4.309693 -0.924159 0.377833
H  -2.941499 -0.124299 1.140353
H  -2.102726 0.492416 -1.205472
H  -3.566576 -0.212005 -1.857075
H  -1.230228 -3.971999 -0.223709
H  -0.868976 0.193819 0.762206
H  1.204253 -4.24466 0.1158
H  1.510868 -0.103819 1.127027
H  -4.793426 1.622587 -1.112309
H  2.562473 -1.167246 -1.502608
H  5.196059 -2.01122 1.767609
H  -3.193264 4.479883 1.602737
H  -4.613375 5.280676 0.92906
H  4.355531 0.076305 -2.62133
H  7.001753 -0.770792 0.627962
H  6.58663 0.291321 -1.572257
H  -1.869895 5.099681 -0.428129
H  -3.303496 5.863054 -1.135227
H  -2.571898 6.528759 0.321835
totalener: -1015.00376357 hartree
nucrepener: 1679.53751971 hartree
electener: -2694.54128328 hartree
oneelecener: -4716.76762529 hartree
twoeener: 2022.22634201 hartree
kineticenergy: 1010.69006374 hartree
xcener: -97.190019323041 hartree
chargesum: -0.0000000
charge: -0.299134 -0.302913 -0.316544 -0.446221 -0.246566 0.022795 -0.092645 0.269138 0.193648 -0.186375 -0.156952 -0.156349 -0.212151 0.253710 0.489220 -0.158254 -0.213706 0.043253 -0.127908 -0.090682 -0.152145 -0.254792 0.097647 0.099178 0.118457 0.100375 0.115903 0.145072 0.121764 0.134901 0.147189 0.127661 0.121907 0.086728 0.094266 0.123454 0.121671 0.121353 0.101444 0.080906 0.081695
qa: -0.2991 -0.3029 -0.3165 -0.4462 -0.2466 0.0228 -0.0926 0.2691 0.1936 -0.1864 -0.1570 -0.1563 -0.2122 0.2537 0.4892 -0.1583 -0.2137 0.0433 -0.1279 -0.0907 -0.1521 -0.2548 0.0976 0.0992 0.1185 0.1004 0.1159 0.1451 0.1218 0.1349 0.1472 0.1277 0.1219 0.0867 0.0943 0.1235 0.1217 0.1214 0.1014 0.0809 0.0817
va: 2.1067 2.0974 2.0837 2.0478 3.1404 3.8191 3.8367 3.8374 3.8486 4.0273 3.8133 4.0347 4.0544 3.8174 4.3036 3.9123 4.0230 3.8852 3.9648 3.9425 3.9619 3.9083 1.0026 1.0118 1.0094 1.0110 1.0165 1.0212 1.0106 1.0047 1.0366 1.0082 1.0154 1.0127 0.9942 1.0004 0.9989 1.0011 1.0141 1.0058 1.0108
dispcorr: -0.016859485 hartree
energy: -1015.020623054544
dipole: -6.75977 5.42894 -1.33083 15.33361 -14.45605 0.87756 -2.96287 2.41926 -0.54361
magnitude: 1.68426 au
magnitude: 4.28105 debye
