program: Orca
programVersion: 5.0.2
elementType: O O O O N C C C C C C C C C C C C C C C C C H H H H H H H H H H H H H H H H H H H
charge: 0
multiplicity: 1
keywords: wb97x-d3
keywords: def2-TZVPP
keywords: def2/J RIJCOSX
keywords: DEFGRID2
keywords: scfconv7
keywords: smallprint printgap noloewdin
keywords: NOSOSCF
formula: C17H19NO4
InChI: InChI=1/C17H19NO4/c1-2-20-17(19)18-12-13-21-14-8-10-16(11-9-14)22-15-6-4-3-5-7-15/h3-11,18H,2,12-13H2,1H3
41 atoms
O  -3.253445 -1.770529 0.114902
O  2.159929 -1.666325 -0.884759
O  -0.804777 1.870169 0.109086
O  -2.753886 1.694972 -1.012577
N  -2.538995 0.96043 1.132082
C  -3.760593 -1.192069 1.295672
C  -3.827486 0.328067 1.233034
C  -1.909045 -1.754767 -0.086335
C  0.819323 -1.697831 -0.606695
C  -1.004253 -2.222513 0.862507
C  -1.440039 -1.299649 -1.312189
C  0.356177 -2.190917 0.60397
C  -0.07878 -1.266769 -1.568618
C  2.959277 -0.801317 -0.203491
C  -2.091933 1.521868 -0.019725
C  2.477261 0.239989 0.581767
C  4.330027 -0.992012 -0.345236
C  -0.183134 2.487578 -1.019019
C  3.378093 1.080256 1.222911
C  5.212799 -0.14274 0.298597
C  4.744634 0.897536 1.090274
C  -0.51573 3.959856 -1.131063
H  -4.772576 -1.582918 1.417323
H  -3.193593 -1.508088 2.179831
H  -4.422615 0.638993 0.376018
H  -4.347009 0.681586 2.129633
H  -1.35105 -2.630827 1.803348
H  -2.145605 -0.945188 -2.050989
H  1.057217 -2.555125 1.344178
H  0.288555 -0.897941 -2.517472
H  -1.863758 0.794465 1.859474
H  1.414432 0.406212 0.696579
H  4.691757 -1.80511 -0.960887
H  -0.45329 1.957129 -1.933408
H  0.884922 2.345114 -0.855016
H  2.996244 1.889175 1.83234
H  6.277263 -0.299356 0.18259
H  5.437466 1.556122 1.596072
H  -0.259046 4.49517 -0.216892
H  0.060399 4.400253 -1.945733
H  -1.570831 4.117856 -1.345773
totalener: -1014.99875178 hartree
nucrepener: 1840.73248762 hartree
electener: -2855.73123940 hartree
oneelecener: -5038.95762201 hartree
twoeener: 2183.22638261 hartree
kineticenergy: 1010.69364432 hartree
xcener: -97.191526092575 hartree
chargesum: -0.0000000
charge: -0.307928 -0.303220 -0.317484 -0.413688 -0.215064 -0.001448 -0.029547 0.182534 0.262291 -0.150681 -0.066527 -0.152405 -0.268125 0.299808 0.425965 -0.214787 -0.206211 0.052852 -0.155090 -0.094691 -0.143166 -0.252314 0.098091 0.068230 0.104368 0.087153 0.118823 0.136349 0.129544 0.125343 0.133818 0.131243 0.122958 0.084765 0.092191 0.125367 0.122797 0.122961 0.079488 0.083773 0.101665
qa: -0.3079 -0.3032 -0.3175 -0.4137 -0.2151 -0.0014 -0.0295 0.1825 0.2623 -0.1507 -0.0665 -0.1524 -0.2681 0.2998 0.4260 -0.2148 -0.2062 0.0529 -0.1551 -0.0947 -0.1432 -0.2523 0.0981 0.0682 0.1044 0.0872 0.1188 0.1363 0.1295 0.1253 0.1338 0.1312 0.1230 0.0848 0.0922 0.1254 0.1228 0.1230 0.0795 0.0838 0.1017
va: 2.0671 2.1105 2.0517 2.0925 3.1626 3.9311 3.8460 3.9066 3.7727 3.8856 3.8343 3.9918 4.0090 3.7576 4.3995 3.8850 4.0207 3.8472 3.9921 3.9485 3.9567 3.9484 1.0092 0.9968 1.0305 1.0070 1.0054 1.0173 1.0048 1.0096 1.0416 1.0126 1.0158 1.0121 0.9910 1.0014 0.9987 1.0006 1.0060 1.0084 1.0139
dispcorr: -0.022288768 hartree
energy: -1015.021040548418
dipole: -1.41947 1.49282 0.07335 10.97047 -10.74244 0.22802 3.14460 -1.90028 1.24432
magnitude: 1.26716 au
magnitude: 3.22088 debye
