program: Orca
programVersion: 5.0.2
elementType: O O O O N C C C C C C C C C C C C C C C C C H H H H H H H H H H H H H H H H H H H
charge: 0
multiplicity: 1
keywords: wb97x-d3
keywords: def2-TZVPP
keywords: def2/J RIJCOSX
keywords: DEFGRID2
keywords: scfconv7
keywords: smallprint printgap noloewdin
keywords: NOSOSCF
formula: C17H19NO4
InChI: InChI=1/C17H19NO4/c1-2-20-17(19)18-12-13-21-14-8-10-16(11-9-14)22-15-6-4-3-5-7-15/h3-11,18H,2,12-13H2,1H3
41 atoms
O  -2.596695 -1.967357 -0.811242
O  2.337257 0.179543 0.372233
O  -2.040996 2.398597 0.170017
O  -3.685857 1.365431 1.321613
N  -3.306259 0.911037 -0.867176
C  -3.785227 -1.456305 -0.243562
C  -4.24488 -0.180001 -0.93674
C  -1.400845 -1.431275 -0.460737
C  1.135149 -0.404429 0.081659
C  -0.423693 -1.391017 -1.451946
C  -1.087534 -0.968403 0.812935
C  0.834801 -0.880563 -1.187788
C  0.17507 -0.458533 1.07726
C  3.496619 -0.451271 0.036839
C  -3.060637 1.547079 0.303341
C  4.588355 0.358046 -0.25174
C  3.626676 -1.835078 0.018053
C  -1.636814 3.119739 1.331325
C  5.809903 -0.219144 -0.557872
C  4.854338 -2.397833 -0.297514
C  5.949873 -1.59908 -0.587983
C  -2.488744 4.346992 1.576243
H  -4.542492 -2.228764 -0.388149
H  -3.698424 -1.292521 0.832302
H  -4.429903 -0.384737 -1.991736
H  -5.197462 0.12562 -0.499687
H  -0.661988 -1.757376 -2.442223
H  -1.811045 -0.991535 1.616021
H  1.57575 -0.844885 -1.976376
H  0.412339 -0.094341 2.068367
H  -2.631471 1.012746 -1.605797
H  4.472387 1.433728 -0.231666
H  2.78257 -2.471162 0.250154
H  -0.603221 3.401932 1.133144
H  -1.643205 2.465415 2.204715
H  6.655675 0.41737 -0.782522
H  4.951694 -3.475397 -0.310327
H  6.902835 -2.047085 -0.83422
H  -3.514806 4.078273 1.820553
H  -2.082583 4.910739 2.41687
H  -2.495826 5.005028 0.707555
totalener: -1015.00067476 hartree
nucrepener: 1770.21800292 hartree
electener: -2785.21867768 hartree
oneelecener: -4898.03370458 hartree
twoeener: 2112.81502691 hartree
kineticenergy: 1010.70037048 hartree
xcener: -97.192476448243 hartree
chargesum: -0.0000000
charge: -0.312606 -0.304982 -0.303072 -0.426027 -0.225407 0.006954 -0.039722 0.173007 0.252608 -0.180209 -0.063662 -0.135428 -0.277061 0.248251 0.426691 -0.216528 -0.161834 0.047051 -0.090704 -0.123445 -0.148849 -0.251408 0.097478 0.101840 0.091646 0.091278 0.122531 0.127269 0.132949 0.124537 0.152279 0.121778 0.131872 0.097210 0.079629 0.123420 0.125634 0.124067 0.098708 0.080807 0.081445
qa: -0.3126 -0.3050 -0.3031 -0.4260 -0.2254 0.0070 -0.0397 0.1730 0.2526 -0.1802 -0.0637 -0.1354 -0.2771 0.2483 0.4267 -0.2165 -0.1618 0.0471 -0.0907 -0.1234 -0.1488 -0.2514 0.0975 0.1018 0.0916 0.0913 0.1225 0.1273 0.1329 0.1245 0.1523 0.1218 0.1319 0.0972 0.0796 0.1234 0.1256 0.1241 0.0987 0.0808 0.0814
va: 2.0722 2.0906 2.0795 2.0809 3.1609 3.8486 3.9170 3.9233 3.8015 3.9971 3.7169 3.9702 4.0407 3.8121 4.3997 4.0316 3.9213 3.8695 3.9399 3.9563 3.9609 3.9324 1.0056 1.0029 1.0047 1.0189 1.0158 1.0133 1.0008 1.0153 1.0317 1.0156 1.0057 0.9933 1.0132 0.9989 1.0003 1.0006 1.0134 1.0098 1.0056
dispcorr: -0.019870598 hartree
energy: -1015.020545355639
dipole: -5.35521 5.41032 0.05511 6.84593 -6.79609 0.04985 2.00373 -2.59368 -0.58995
magnitude: 0.59461 au
magnitude: 1.51139 debye
