program: Orca
programVersion: 5.0.2
elementType: O O O O N C C C C C C C C C C C C C C C C C H H H H H H H H H H H H H H H H H H H
charge: 0
multiplicity: 1
keywords: wb97x-d3
keywords: def2-TZVPP
keywords: def2/J RIJCOSX
keywords: DEFGRID2
keywords: scfconv7
keywords: smallprint printgap noloewdin
keywords: NOSOSCF
formula: C17H19NO4
InChI: InChI=1/C17H19NO4/c1-2-20-17(19)18-12-13-21-14-8-10-16(11-9-14)22-15-6-4-3-5-7-15/h3-11,18H,2,12-13H2,1H3
41 atoms
O  -2.638394 -1.967431 -0.84328
O  2.282767 0.145856 0.447185
O  -1.949177 2.331559 0.184691
O  -3.624372 1.339447 1.329037
N  -3.280147 0.917893 -0.872619
C  -3.823646 -1.443097 -0.279557
C  -4.24986 -0.145184 -0.954547
C  -1.441088 -1.448342 -0.469854
C  1.087894 -0.435188 0.124272
C  -0.469239 -1.339165 -1.460797
C  -1.124994 -1.066189 0.829373
C  0.78646 -0.835042 -1.170887
C  0.134084 -0.562271 1.119727
C  3.451655 -0.43285 0.056145
C  -3.000601 1.518023 0.30964
C  4.522759 0.419823 -0.180144
C  3.611925 -1.808352 -0.064249
C  -1.507795 3.012614 1.356536
C  5.754466 -0.105703 -0.534812
C  4.849407 -2.318644 -0.427528
C  5.924831 -1.476279 -0.665756
C  -2.303948 4.272255 1.624682
H  -4.594772 -2.197621 -0.443922
H  -3.74365 -1.297895 0.799557
H  -4.442704 -0.329391 -2.011861
H  -5.192724 0.180788 -0.511027
H  -0.709678 -1.646354 -2.470603
H  -1.844571 -1.150665 1.632009
H  1.523458 -0.743438 -1.958735
H  0.374194 -0.259315 2.130594
H  -2.603732 1.007773 -1.611294
H  4.382863 1.48829 -0.080659
H  2.783826 -2.478571 0.126314
H  -0.462978 3.251174 1.159148
H  -1.540718 2.343852 2.218456
H  6.584373 0.564371 -0.717114
H  4.970736 -3.390031 -0.519057
H  6.885927 -1.883517 -0.948553
H  -2.286107 4.943013 0.765729
H  -3.340044 4.044662 1.869585
H  -1.870447 4.805521 2.471498
totalener: -1015.00051613 hartree
nucrepener: 1777.30318193 hartree
electener: -2792.30369806 hartree
oneelecener: -4912.21781984 hartree
twoeener: 2119.91412177 hartree
kineticenergy: 1010.69769306 hartree
xcener: -97.191955192977 hartree
chargesum: -0.0000000
charge: -0.314695 -0.305914 -0.303070 -0.425430 -0.224240 0.008717 -0.041686 0.173664 0.262093 -0.185267 -0.056812 -0.135336 -0.286861 0.251670 0.427513 -0.219093 -0.165662 0.049020 -0.089608 -0.121494 -0.149440 -0.252066 0.096981 0.101045 0.091552 0.090690 0.123607 0.126347 0.133699 0.124789 0.151750 0.121204 0.132263 0.096632 0.079484 0.123696 0.125563 0.123853 0.081488 0.098644 0.080708
qa: -0.3147 -0.3059 -0.3031 -0.4254 -0.2242 0.0087 -0.0417 0.1737 0.2621 -0.1853 -0.0568 -0.1353 -0.2869 0.2517 0.4275 -0.2191 -0.1657 0.0490 -0.0896 -0.1215 -0.1494 -0.2521 0.0970 0.1010 0.0916 0.0907 0.1236 0.1263 0.1337 0.1248 0.1518 0.1212 0.1323 0.0966 0.0795 0.1237 0.1256 0.1239 0.0815 0.0986 0.0807
va: 2.0686 2.0873 2.0789 2.0816 3.1624 3.8479 3.9178 3.9302 3.7830 3.9927 3.7183 3.9691 4.0348 3.8103 4.3994 4.0355 3.9246 3.8661 3.9396 3.9550 3.9622 3.9355 1.0058 1.0036 1.0046 1.0188 1.0154 1.0113 1.0005 1.0151 1.0325 1.0159 1.0057 0.9931 1.0134 0.9988 1.0003 1.0007 1.0055 1.0130 1.0097
dispcorr: -0.020116684 hartree
energy: -1015.020632812999
dipole: -4.95047 5.03743 0.08696 6.87303 -6.81999 0.05304 1.90642 -2.50665 -0.60023
magnitude: 0.60881 au
magnitude: 1.54747 debye
