program: Orca
programVersion: 5.0.2
elementType: O O O O N C C C C C C C C C C C C C C C C C H H H H H H H H H H H H H H H H H H H
charge: 0
multiplicity: 1
keywords: wb97x-d3
keywords: def2-TZVPP
keywords: def2/J RIJCOSX
keywords: DEFGRID2
keywords: scfconv7
keywords: smallprint printgap noloewdin
keywords: NOSOSCF
formula: C17H19NO4
InChI: InChI=1/C17H19NO4/c1-2-20-17(19)18-12-13-21-14-8-10-16(11-9-14)22-15-6-4-3-5-7-15/h3-11,18H,2,12-13H2,1H3
41 atoms
O  -2.818172 -2.135743 0.622605
O  2.070775 -0.496638 -1.310693
O  -1.802826 1.985727 -0.74468
O  -2.76518 1.843882 1.294039
N  -3.460708 0.556494 -0.440544
C  -3.666127 -1.227557 1.298148
C  -4.354526 -0.258635 0.343197
C  -1.595256 -1.708704 0.215241
C  0.898786 -0.926081 -0.753999
C  -1.158242 -2.130989 -1.035145
C  -0.755399 -0.915004 0.99113
C  0.085009 -1.751615 -1.513414
C  0.4776 -0.514276 0.502672
C  3.21093 -0.470736 -0.565811
C  -2.676631 1.498099 0.139401
C  3.521105 -1.453395 0.367379
C  4.098373 0.568526 -0.810908
C  -0.841332 2.923517 -0.266508
C  4.723722 -1.382332 1.053843
C  5.299703 0.622314 -0.12234
C  5.617188 -0.348064 0.816464
C  -1.392689 4.330578 -0.179991
H  -4.427073 -1.835982 1.789968
H  -3.142584 -0.674982 2.080913
H  -4.979571 -0.815942 -0.355238
H  -5.021987 0.37951 0.926269
H  -1.799531 -2.765842 -1.633202
H  -1.051907 -0.581805 1.976121
H  0.41823 -2.080147 -2.489192
H  1.107983 0.1211 1.112045
H  -3.188969 0.225289 -1.350476
H  2.834826 -2.269026 0.555247
H  3.843529 1.322869 -1.543719
H  -0.027716 2.871878 -0.989723
H  -0.448353 2.601645 0.699678
H  4.964052 -2.149394 1.778208
H  5.988065 1.433647 -0.319041
H  6.55335 -0.301087 1.355827
H  -1.800145 4.656308 -1.137037
H  -2.170932 4.408406 0.576634
H  -0.591619 5.019058 0.091989
totalener: -1014.99984924 hartree
nucrepener: 1800.98455955 hartree
electener: -2815.98440879 hartree
oneelecener: -4959.58601258 hartree
twoeener: 2143.60160379 hartree
kineticenergy: 1010.69783323 hartree
xcener: -97.192315765579 hartree
chargesum: 0.0000000
charge: -0.316558 -0.307549 -0.302737 -0.425143 -0.221766 0.011818 -0.046335 0.178126 0.247346 -0.173795 -0.071823 -0.171618 -0.245169 0.246633 0.429651 -0.157465 -0.218015 0.052436 -0.119941 -0.091481 -0.146221 -0.253474 0.097503 0.099315 0.091444 0.090301 0.122894 0.126862 0.124217 0.136894 0.150251 0.131333 0.122128 0.095569 0.077565 0.126110 0.124060 0.124352 0.081813 0.100349 0.080122
qa: -0.3166 -0.3075 -0.3027 -0.4251 -0.2218 0.0118 -0.0463 0.1781 0.2473 -0.1738 -0.0718 -0.1716 -0.2452 0.2466 0.4297 -0.1575 -0.2180 0.0524 -0.1199 -0.0915 -0.1462 -0.2535 0.0975 0.0993 0.0914 0.0903 0.1229 0.1269 0.1242 0.1369 0.1503 0.1313 0.1221 0.0956 0.0776 0.1261 0.1241 0.1244 0.0818 0.1003 0.0801
va: 2.0660 2.0857 2.0781 2.0823 3.1652 3.8456 3.9208 3.9247 3.7903 3.9787 3.7622 4.0405 3.9333 3.8118 4.3980 3.9297 4.0320 3.8665 3.9517 3.9374 3.9611 3.9382 1.0050 1.0051 1.0041 1.0176 1.0137 1.0114 1.0108 1.0009 1.0339 1.0063 1.0154 0.9937 1.0114 1.0001 0.9990 1.0006 1.0054 1.0137 1.0093
dispcorr: -0.020764310 hartree
energy: -1015.020613551786
dipole: -2.94848 2.87834 -0.07014 9.06469 -9.08255 -0.01786 2.89684 -3.12826 -0.23142
magnitude: 0.24247 au
magnitude: 0.61631 debye
