program: Gaussian 09
title: 000053754
version: EM64L-G09RevD.01
frameworkgroup: C1[X(C18H28N2O3)]
method: RPBEPBE
basis: SDD
operation: Freq
keyword: #p
keyword: freq=noraman
keyword: PBEPBE/SDD
title: #p freq=noraman PBEPBE/SDD
converged: YES YES NO NO
title: Mulliken charges:
elementType: O O O N N C C C C C C C C C C C C C C C C C C H H H H H H H H H H H H H H H H H H H H H H H H H H H H
charge: -0.249827 -0.299077 -0.284139 -0.078392 -0.119076 -0.349096 -0.346925 -0.449228 -0.331146 -0.317480 0.277401 -0.422139 -0.252028 -0.649146 0.041299 0.352477 0.349150 0.484194 -0.577239 -0.595156 -0.820884 -0.820274 -0.817291 0.261233 0.178848 0.185968 0.204394 0.208836 0.226521 0.211763 0.202034 0.194996 0.209497 0.272958 0.214579 0.202452 0.215103 0.241214 0.231015 0.246181 0.237623 0.235383 0.218478 0.217987 0.285601 0.227008 0.223035 0.241485 0.223584 0.234482 0.221765
chargesum: 0.00000
title: Mulliken charges with hydrogens summed into heavy atoms:
elementType: O O O N N C C C C C C C C C C C C C C C C C C
charge: -0.249827 -0.299077 -0.284139 -0.078392 -0.119076 0.090985 0.043437 -0.013872 0.082650 0.087013 0.277401 0.065398 0.165527 0.069263 0.041299 0.352477 0.349150 0.484194 -0.339616 -0.359773 -0.098817 -0.128746 -0.137460
polarizability: 2.48897428e+02 1.87454776e+01 2.20466460e+02 1.20473223e+01 -2.07413426e+01 1.84716377e+02
1716.lowfreq: -11.7593 -4.6479 0.0009 0.0010 0.0011 3.1323 12.5435 14.4176 19.4403
frequency: 8.0639 13.1417 18.2772 20.9908 41.8582 47.7381 61.7846 75.2041 80.8295 88.8412 127.4039 132.0865 151.0973 162.4603 183.3855 193.5317 217.6285 223.7228 236.3823 242.4108 246.6220 266.1471 285.0535 303.9261 306.5721 314.3533 365.5773 392.6428 394.7226 403.7077 448.2152 467.0419 485.8950 489.2300 510.7332 526.2242 561.7440 563.2989 573.4122 586.9654 604.7548 615.9340 700.0002 749.8869 762.9929 790.3315 811.1947 841.8025 863.0900 870.5064 886.5563 891.0911 906.5747 934.1368 950.5602 978.5450 996.8000 1008.9552 1012.3979 1016.9923 1025.9291 1029.7654 1034.8436 1041.1408 1045.9610 1048.9134 1052.1191 1064.5065 1083.1525 1099.3635 1105.1133 1113.4099 1135.7888 1138.0902 1167.0244 1188.2450 1193.3482 1200.8511 1228.7411 1239.7519 1251.4992 1257.2681 1270.4349 1284.7527 1297.8356 1319.0319 1325.9523 1338.6377 1351.7950 1358.5837 1364.8648 1365.8710 1371.3814 1379.7813 1392.1692 1395.5303 1396.6864 1401.0176 1416.3258 1439.4116 1439.7886 1442.7769 1446.8624 1448.6198 1450.0993 1452.3520 1461.8562 1462.5549 1463.6786 1473.6864 1475.9799 1476.7872 1483.2107 1485.0862 1494.6334 1498.3577 1596.7436 1599.5399 1613.7636 2806.7872 2846.3660 2861.5827 2952.2769 2954.4226 2961.1608 2966.5543 2970.4335 2971.7929 2973.4311 2982.0203 2994.1147 3014.6556 3018.8548 3047.4609 3050.7067 3053.7157 3053.9259 3074.4826 3076.6460 3081.9208 3086.1594 3087.9728 3092.9963 3096.6585 3099.6636 3110.9826 3115.3588
redmass: 3.5488 3.7698 1.7422 1.5497 4.4946 3.9924 3.2597 2.8009 1.8986 2.0005 1.3187 2.0568 1.8818 2.6283 2.2327 2.4374 2.7386 2.9579 3.5070 1.8663 3.6028 2.5433 2.9333 3.3599 2.7077 3.0291 4.8060 3.0822 2.1940 2.3912 5.0593 2.8437 3.6531 4.3382 3.0593 3.0704 4.0469 4.3705 3.2806 3.0348 2.6410 2.6841 3.3060 3.5000 4.1600 4.8522 3.8607 1.6039 1.3827 2.6326 2.7840 1.3263 2.5032 2.2972 3.2671 2.1660 3.1055 2.5308 1.7461 1.5519 2.1792 2.1628 1.8377 1.5430 1.5417 1.5916 2.0144 1.8224 3.5467 1.9577 2.1063 1.4766 2.7243 3.1185 2.3109 1.5613 1.0835 1.8238 1.1726 1.3382 1.3866 2.1504 1.4058 1.3415 1.3578 1.4309 5.6475 1.2298 1.4479 1.3100 2.4851 2.4056 1.2760 1.4379 1.2802 1.7545 1.2337 1.2538 2.7731 1.7872 1.1067 1.0834 1.2308 1.1005 1.1022 1.1009 1.0917 1.1037 1.0660 1.0584 1.0835 1.0864 1.0544 1.1636 1.3724 1.0987 7.6757 7.3855 5.8892 1.0701 1.0703 1.0695 1.0575 1.0662 1.0426 1.0661 1.0396 1.0417 1.0386 1.0672 1.0845 1.0889 1.1041 1.0946 1.0937 1.0944 1.0917 1.0888 1.0970 1.0996 1.0980 1.0999 1.0948 1.1005 1.0979 1.0912 1.0918
irintensity: 0.1900 0.4994 1.9819 0.5357 0.4797 0.1843 0.7271 3.5302 2.4202 0.7279 1.9229 3.5324 3.4358 3.8950 2.2732 3.2772 0.7930 0.1339 0.7929 3.2415 3.4952 1.8956 1.7510 6.9297 4.9884 10.0456 17.5440 3.0615 0.2637 2.6907 6.0071 0.4451 3.0244 3.4279 0.0652 1.7431 0.3069 0.7445 10.4707 7.1066 3.9154 12.8765 3.2263 3.7034 2.7679 6.1100 25.3421 0.1500 19.5165 34.0642 1.3323 0.1040 17.0312 0.6929 2.3015 0.6756 37.3453 28.5798 4.8905 3.8768 17.9059 10.1220 1.2013 1.1026 3.0957 21.6806 25.9197 15.4823 39.4596 140.6779 10.1191 14.4689 50.1406 98.5301 23.0582 11.4175 0.9007 78.1248 15.4591 1.4954 0.6726 81.8888 27.8616 22.2533 3.5784 19.4499 9.9237 4.1121 7.8379 7.5070 8.2217 10.8986 0.2849 8.3561 15.0619 30.4478 10.2553 8.6590 0.8386 15.9377 6.3029 1.4916 10.8152 4.0777 32.7516 11.6346 1.1082 9.2878 28.2404 11.5062 12.6821 6.1010 22.1612 33.2836 83.6351 18.8122 150.8992 52.8880 3.9457 81.6309 63.1447 127.3154 24.0176 58.3563 54.1370 71.5683 45.5800 23.3246 37.1262 87.8635 21.8283 56.3088 37.0474 35.6510 17.1651 13.4702 34.1063 9.4896 44.5252 17.3647 33.4441 20.3759 14.0447 4.5307 24.6740 29.9852 15.0891
temp: 298.150 k
press: 1.00000 atm
elementType: 8 8 8 7 7 6 6 6 6 6 6 6 6 6 6 6 6 6 6 6 6 6 6 1 1 1 1 1 1 1 1 1 1 1 1 1 1 1 1 1 1 1 1 1 1 1 1 1 1 1 1
symmnumber: 1
zpe: 1135832.7 jmol-1
zpe.correction: 0.432616 hartree
zpe.thermalcorrener: 0.457931 hartree
zpe.thermalcorrenthalpy: 0.458875 hartree
zpe.thermalcorrgfe: 0.372460 hartree
zpe.sumelectzpe: -1036.066525 hartree
zpe.sumelectthermal: -1036.041210 hartree
zpe.sumelectthermalent: -1036.040265 hartree
zpe.sumelectthermalfe: -1036.126680 hartree
dipole: -2.7256 4.9441 -1.7026
dipole: 5.8968
quadrupole: -137.8557 -127.7143 -140.4873
quadrupole: 14.1256 -3.4476 -6.3265
quadrupole: -2.5033 7.6382 -5.1349 14.1256 -3.4476 -6.3265
hfenergy: -1036.4991407 hartree
pointgroup: C01 [X(C18H28N2O3)]
dipole: 0.6921535 1.4232931 1.6962864 debye
polarizability: 250.1011814|-23.2843038|191.5579188|6.9230881|22.1476134|212.4211647 unknown
InChI: InChI=1S/C18H28N2O3/c1-14-11-15(2)18(16(3)12-14)23-10-5-19(4)17(21)13-20-6-8-22-9-7-20/h11-12H,5-10,13H2,1-4H3
charge 0 multiplicity 1
51 atoms
O  -4.896251 -2.860216 -1.517217
O  1.206354 0.887076 0.732951
O  -1.495409 1.153682 -1.484812
N  -3.73715 -0.354055 -0.615125
N  -1.269835 2.259047 0.553916
C  -2.874704 -1.505918 -0.991533
C  -5.046453 -0.828088 -0.098963
C  -3.094345 0.582022 0.31514
C  -3.597472 -2.377953 -2.027235
C  -5.734878 -1.707541 -1.156544
C  -1.894663 1.340668 -0.294908
C  -0.021492 2.893715 0.091836
C  1.230356 2.359534 0.814121
C  -1.625269 2.441058 1.969901
C  2.469676 0.233393 0.622734
C  2.891585 -0.1904 -0.665839
C  3.219475 -0.049949 1.794322
C  4.889428 -1.212566 0.385556
C  4.106284 -0.913402 -0.756548
C  4.429498 -0.771155 1.650747
C  2.066181 0.128191 -1.898284
C  2.727236 0.399964 3.157515
C  6.170582 -2.020972 0.261279
H  -1.941879 -1.113112 -1.428051
H  -2.623282 -2.12869 -0.094742
H  -4.931217 -1.421588 0.845136
H  -5.688666 0.046919 0.122198
H  -2.74171 0.076404 1.255061
H  -3.856614 1.324275 0.627051
H  -3.017007 -3.286803 -2.255778
H  -3.757461 -1.790069 -2.955845
H  -5.944968 -1.096976 -2.061236
H  -6.675149 -2.133438 -0.767702
H  0.052005 2.688228 -0.9880
H  -0.080352 3.990359 0.249473
H  1.247317 2.665117 1.88142
H  2.135858 2.766013 0.320652
H  -2.710685 2.342663 2.126977
H  -1.336909 3.459871 2.286026
H  -1.107956 1.712272 2.626137
H  4.44533 -1.252537 -1.744032
H  5.019242 -0.99995 2.547844
H  2.263631 1.158161 -2.257152
H  2.312028 -0.559207 -2.726027
H  0.984309 0.073233 -1.690273
H  3.228692 -0.160522 3.964846
H  2.92699 1.476282 3.328033
H  1.636205 0.25201 3.248589
H  6.687536 -1.817553 -0.693529
H  5.961685 -3.108261 0.294538
H  6.872891 -1.796735 1.083475
