program: Orca
programVersion: 5.0.2
elementType: O O O O O O C C C C H H H H H H
charge: 0
multiplicity: 1
keywords: wb97x-d3
keywords: def2-TZVPP
keywords: def2/J RIJCOSX
keywords: DEFGRID2
keywords: scfconv7
keywords: smallprint printgap noloewdin
keywords: NOSOSCF
formula: C4H6O6
InChI: InChI=1/C4H6O6/c5-1(3(7)8)2(6)4(9)10/h1-2,5-7,9H
16 atoms
O  -0.40924 -0.132377 1.606641
O  0.763209 -1.2551 -0.96239
O  -2.466466 -1.191945 0.356914
O  1.784122 1.948032 0.223983
O  -2.175711 0.013014 -1.502547
O  2.74869 -0.059099 0.443466
C  -0.623441 0.311465 0.294926
C  0.597764 0.093264 -0.615999
C  -1.835209 -0.304944 -0.388763
C  1.835202 0.636203 0.07463
H  -0.82467 1.384929 0.35633
H  0.444082 0.654623 -1.541388
H  -0.22807 -1.080313 1.607868
H  1.202806 -1.719506 -0.239042
H  -3.231714 -1.549966 -0.121636
H  2.572451 2.269494 0.69069
elementType: O C H
totalener: -607.52974210 hartree
nucrepener: 578.06271318 hartree
electener: -1185.59245528 hartree
oneelecener: -1980.47489967 hartree
twoeener: 794.88244439 hartree
cpcmener: -0.05143553 hartree
kineticenergy: 605.16250346 hartree
xcener: -52.875879796285 hartree
chargesum: -0.0000000
charge: -0.422037 -0.424701 -0.289595 -0.290270 -0.463818 -0.446773 0.144522 0.161702 0.379874 0.357311 0.134045 0.129077 0.244394 0.242094 0.271529 0.272646
qa: -0.4220 -0.4247 -0.2896 -0.2903 -0.4638 -0.4468 0.1445 0.1617 0.3799 0.3573 0.1340 0.1291 0.2444 0.2421 0.2715 0.2726
va: 2.0046 2.0141 2.2241 2.2027 2.0283 2.0440 3.8140 3.8610 4.2440 4.3089 1.0169 1.0269 1.0007 1.0102 0.9838 0.9814
dispcorr: -0.005919430 hartree
energy: -607.535661534324
dipole: -0.19231 -0.02058 -0.21288 0.02948 0.11695 0.14643 0.86927 -0.02363 0.84563
magnitude: 0.88423 au
magnitude: 2.24752 debye
