program: Orca
programVersion: 5.0.2
elementType: O O O O O O C C C C H H H H H H
charge: 0
multiplicity: 1
keywords: wb97x-d3
keywords: def2-TZVPP
keywords: def2/J RIJCOSX
keywords: DEFGRID2
keywords: scfconv7
keywords: smallprint printgap noloewdin
keywords: NOSOSCF
formula: C4H6O6
InChI: InChI=1/C4H6O6/c5-1(3(7)8)2(6)4(9)10/h1-2,5-7,9H
16 atoms
O  -0.662931 1.397218 0.72859
O  0.662806 -1.397301 0.728557
O  -1.911446 -1.352327 -1.178454
O  1.911591 1.352525 -1.177922
O  -2.650882 -0.458391 0.733431
O  2.650851 0.458176 0.733837
C  -0.646155 0.418832 -0.273694
C  0.646207 -0.418815 -0.273633
C  -1.848949 -0.504395 -0.164813
C  1.848986 0.504394 -0.164456
H  -0.718628 0.944864 -1.22959
H  0.718828 -0.944753 -1.229571
H  -0.713217 0.97804 1.596784
H  0.713164 -0.978223 1.596791
H  -2.675551 -1.943169 -1.082034
H  2.675692 1.943343 -1.081305
elementType: O C H
totalener: -607.53057826 hartree
nucrepener: 578.22034520 hartree
electener: -1185.75092346 hartree
oneelecener: -1980.75486689 hartree
twoeener: 795.00394343 hartree
cpcmener: -0.05272462 hartree
kineticenergy: 605.15798827 hartree
xcener: -52.874945222803 hartree
chargesum: 0.0000000
charge: -0.422891 -0.422885 -0.292222 -0.292229 -0.446994 -0.446993 0.159806 0.159757 0.356287 0.356308 0.132163 0.132160 0.243171 0.243168 0.270693 0.270700
qa: -0.4229 -0.4229 -0.2922 -0.2922 -0.4470 -0.4470 0.1598 0.1598 0.3563 0.3563 0.1322 0.1322 0.2432 0.2432 0.2707 0.2707
va: 2.0140 2.0140 2.1951 2.1951 2.0440 2.0440 3.8113 3.8114 4.2978 4.2979 1.0198 1.0198 1.0035 1.0035 0.9831 0.9831
dispcorr: -0.005993063 hartree
energy: -607.536571327369
dipole: 0.00022 0.00002 0.00024 0.00014 0.00003 0.00017 -1.22242 -0.04534 -1.26776
magnitude: 1.26776 au
magnitude: 3.22239 debye
