program: Orca
programVersion: 5.0.2
elementType: O O O O O O C C C C H H H H H H
charge: 0
multiplicity: 1
keywords: wb97x-d3
keywords: def2-TZVPP
keywords: def2/J RIJCOSX
keywords: DEFGRID2
keywords: scfconv7
keywords: smallprint printgap noloewdin
keywords: NOSOSCF
formula: C4H6O6
InChI: InChI=1/C4H6O6/c5-1(3(7)8)2(6)4(9)10/h1-2,5-7,9H
16 atoms
O  -0.47293 -0.133017 1.635007
O  0.707115 -1.362875 -0.64632
O  -2.490441 -1.200558 0.297924
O  1.741147 1.932584 0.227159
O  -2.232051 0.153953 -1.459178
O  2.792055 -0.036161 0.346837
C  -0.652513 0.319907 0.334328
C  0.572767 0.021488 -0.542755
C  -1.875933 -0.241019 -0.384527
C  1.824721 0.619857 0.069311
H  -0.797405 1.402243 0.385559
H  0.424096 0.485791 -1.527911
H  -0.338241 -1.085839 1.613154
H  1.62461 -1.59536 -0.458085
H  -3.233838 -1.520259 -0.23082
H  2.56065 2.257038 0.623991
totalener: -607.50265537 hartree
nucrepener: 579.07458790 hartree
electener: -1186.57724327 hartree
oneelecener: -1982.43115051 hartree
twoeener: 795.85390724 hartree
kineticenergy: 605.29030432 hartree
xcener: -52.886952863645 hartree
chargesum: -0.0000000
charge: -0.335082 -0.359558 -0.257625 -0.258403 -0.346233 -0.354281 0.161958 0.075862 0.318277 0.316711 0.118168 0.103422 0.189802 0.206261 0.207846 0.212875
qa: -0.3351 -0.3596 -0.2576 -0.2584 -0.3462 -0.3543 0.1620 0.0759 0.3183 0.3167 0.1182 0.1034 0.1898 0.2063 0.2078 0.2129
va: 2.0926 2.0831 2.2333 2.2177 2.1533 2.1346 3.7844 4.0291 4.2768 4.2867 1.0216 1.0205 1.0586 1.0546 1.0415 1.0364
dispcorr: -0.005711982 hartree
energy: -607.508367353726
dipole: 0.24906 -0.04935 0.19970 0.00393 0.17790 0.18184 0.36608 -0.15079 0.21529
magnitude: 0.34539 au
magnitude: 0.87792 debye
