program: Orca
programVersion: 5.0.2
elementType: O O O O O O C C C C H H H H H H
charge: 0
multiplicity: 1
keywords: wb97x-d3
keywords: def2-TZVPP
keywords: def2/J RIJCOSX
keywords: DEFGRID2
keywords: scfconv7
keywords: smallprint printgap noloewdin
keywords: NOSOSCF
formula: C4H6O6
InChI: InChI=1/C4H6O6/c5-1(3(7)8)2(6)4(9)10/h1-2,5-7,9H
16 atoms
O  -0.62417 1.361551 0.750153
O  0.624151 -1.361758 0.749912
O  -1.969013 -1.309129 -1.182263
O  1.969251 1.309272 -1.181808
O  -2.584934 -0.466367 0.795424
O  2.584899 0.466128 0.795814
C  -0.641148 0.428999 -0.280331
C  0.64121 -0.428964 -0.280359
C  -1.842561 -0.489012 -0.146231
C  1.842205 0.489491 -0.145572
H  -0.711352 0.954328 -1.240209
H  0.711548 -0.954048 -1.24037
H  -1.197033 1.043379 1.458179
H  1.196762 -1.043624 1.458163
H  -2.715197 -1.90302 -1.024188
H  2.715743 1.902791 -1.023791
totalener: -607.50477311 hartree
nucrepener: 580.94143167 hartree
electener: -1188.44620478 hartree
oneelecener: -1986.18006831 hartree
twoeener: 797.73386354 hartree
kineticenergy: 605.28818385 hartree
xcener: -52.888218925845 hartree
chargesum: -0.0000000
charge: -0.349632 -0.349609 -0.263006 -0.262993 -0.349758 -0.349740 0.106678 0.106736 0.341271 0.341274 0.100918 0.100942 0.201158 0.201146 0.212313 0.212301
qa: -0.3496 -0.3496 -0.2630 -0.2630 -0.3498 -0.3497 0.1067 0.1067 0.3413 0.3413 0.1009 0.1009 0.2012 0.2011 0.2123 0.2123
va: 2.0944 2.0944 2.2110 2.2111 2.1443 2.1443 3.9249 3.9251 4.2543 4.2544 1.0243 1.0243 1.0605 1.0605 1.0370 1.0370
dispcorr: -0.005679667 hartree
energy: -607.510452777119
dipole: 0.00045 -0.00051 -0.00007 -0.00023 0.00045 0.00022 -1.49305 0.46373 -1.02932
magnitude: 1.02932 au
magnitude: 2.61632 debye
