program: Orca
programVersion: 5.0.2
elementType: Br C H H H
charge: 0
multiplicity: 1
keywords: wb97x-d3
keywords: def2-TZVPP
keywords: def2/J RIJCOSX
keywords: DEFGRID2
keywords: scfconv7
keywords: smallprint printgap noloewdin
keywords: NOSOSCF
formula: CH3Br
InChI: InChI=1/CH3Br/c1-2/h1H3
5 atoms
Br -0.338958 0.000289 0.000273
C  1.612033 -0.00012 -0.000241
H  1.966612 -1.023806 0.09301
H  1.96623 0.431291 -0.933253
H  1.965778 0.592274 0.840052
elementType: Br C H
totalener: -2614.13875089 hartree
nucrepener: 88.62562654 hartree
electener: -2702.76437742 hartree
oneelecener: -3812.08156978 hartree
twoeener: 1109.31719236 hartree
cpcmener: -0.00403184 hartree
kineticenergy: 2610.26204523 hartree
xcener: -74.330242686420 hartree
energy: -13140.8239 -1703.3744 -1534.7069 -1534.6300 -1534.6300 -280.7667 -239.4044 -180.2425 -179.9401 -179.9401 -74.4367 -74.3540 -74.3540 -74.1050 -74.1049 -24.8450 -21.0430 -14.4061 -14.4037 -12.8241 -10.0377 -10.0373 2.2399 4.0933 5.4175 5.4184 6.7875 8.1021 8.1032 8.3157 9.5186 9.5190 10.5830 10.5838 12.2902 12.2920 12.6089 14.9176 14.9192 15.1376 16.7699 21.6291 21.6336 26.2856 26.3002 27.8549 27.8567 28.1727 29.9919 29.9978 32.8718 33.5252 33.5285 38.1608 39.1144 39.1153 39.8557 41.7402 41.7418 42.9988 43.0082 43.9352 44.6743 45.1034 46.3075 46.3104 46.4397 46.6624 46.6647 48.7520 48.7589 53.1985 58.7652 58.7791 68.4863 71.5428 71.5482 74.2944 78.7718 80.7922 80.7965 81.9243 81.9277 84.2369 85.8671 85.8725 92.2899 95.6342 95.7781 95.7855 97.3936 97.3964 101.8181 105.8190 106.0339 106.0366 108.3271 108.3285 112.4330 112.4353 113.2933 113.3105 113.3147 117.5920 120.0842 120.0901 124.8103 126.7348 126.7398 128.9545 139.9950 140.0056 141.9903 143.2029 143.8067 146.7464 146.7513 153.7363 153.7424 206.9114 636.8851 electronvolt
chargesum: 0.0000000
charge: -0.147984 -0.265004 0.137766 0.137345 0.137877
qa: -0.1480 -0.2650 0.1378 0.1373 0.1379
va: 1.0700 3.9651 0.9924 0.9926 0.9924
dispcorr: -0.000202250 hartree
energy: -2614.138953135653
dipole: 8.56021 -7.58683 0.97338 -0.00145 0.00093 -0.00053 -0.00144 0.00112 -0.00032
magnitude: 0.97338 au
magnitude: 2.47413 debye
