program: Orca
programVersion: 5.0.2
elementType: S S N C C H H H H H
charge: 0
multiplicity: 1
keywords: wb97x-d3
keywords: def2-TZVPP
keywords: def2/J RIJCOSX
keywords: DEFGRID2
keywords: scfconv7
keywords: smallprint printgap noloewdin
keywords: NOSOSCF
formula: C2H5NS2
InChI: InChI=1/C2H5NS2/c1-3-2(4)5/h3-4H,1H3
10 atoms
S  -1.753568 -0.512887 0.00002
S  0.417881 1.556018 0.000199
N  0.759573 -1.085495 -0.000268
C  2.2030 -1.039586 0.000263
C  -0.04643 -0.033214 -0.000192
H  0.353479 -2.011212 -0.000163
H  2.594228 -1.538992 0.885249
H  2.537263 -0.007789 -0.000838
H  2.594808 -1.541059 -0.883287
H  -2.238544 0.733462 -0.000025
elementType: S N C H
totalener: -930.40014844 hartree
nucrepener: 275.88151203 hartree
electener: -1206.28166046 hartree
oneelecener: -1829.21545407 hartree
twoeener: 622.93379361 hartree
cpcmener: -0.01701179 hartree
kineticenergy: 928.46915667 hartree
xcener: -51.512300298088 hartree
energy: -2421.0112 -2419.1340 -393.8770 -283.0917 -280.3037 -219.5667 -217.7113 -163.8865 -163.7649 -163.6667 -162.0264 -161.9090 -161.8128 -29.8519 -25.1010 -22.6686 -22.2405 -18.8095 -16.9170 -15.2370 -14.9191 -13.7903 -13.2467 -12.8612 -12.2344 -9.7001 -8.7709 -8.4459 1.1353 2.0223 3.5473 3.8259 4.5831 5.0137 5.5205 5.7801 5.9205 6.4188 7.1432 7.5086 8.0715 8.4496 9.1631 9.3606 9.6869 9.8467 9.9999 10.0772 11.0341 11.0701 11.8830 12.1168 13.2029 13.4415 13.6057 13.8546 14.3614 14.3809 14.9400 15.1495 15.1991 15.8964 16.8182 17.0681 17.1826 18.4901 19.3299 19.5036 20.4690 20.6675 21.9971 22.2185 22.9794 23.6632 24.9807 25.6457 26.5203 26.5240 27.3761 28.4574 28.5720 28.8287 28.9809 30.1999 30.4846 31.5687 32.4563 32.5379 33.9875 34.8092 35.7275 36.8408 37.4391 39.0938 39.8762 40.5717 41.1647 41.6816 42.0576 42.0851 42.6029 42.6474 43.6094 43.6227 43.9028 43.9411 44.5221 44.9345 45.3920 45.8365 46.1793 46.3410 46.6840 47.7582 48.5408 48.8235 49.5432 50.1678 50.6618 50.7252 51.0631 51.5120 52.5235 53.2095 53.7948 54.2520 54.7869 55.4768 56.9448 58.4157 58.5231 60.7271 60.8748 62.1695 64.2223 65.2487 65.6799 66.7654 68.2102 70.5287 71.8631 72.5429 72.7406 72.9362 75.5310 77.1164 77.7520 78.2941 78.8754 80.0810 80.1994 82.3392 82.7937 83.7112 84.7263 85.8212 86.6068 86.7077 88.2562 89.4519 89.9733 90.5275 91.8789 92.7627 92.8249 93.3190 93.8538 94.5091 95.7604 96.0927 97.3681 97.8803 98.7933 99.1516 99.8476 100.7880 101.0503 102.7760 103.9838 105.3293 105.9823 105.9922 106.5351 107.1110 108.9967 109.7287 110.4092 111.1957 112.5923 112.6194 113.1269 114.0450 114.6494 115.0109 116.7215 117.0193 119.3508 121.0137 122.7793 123.2374 127.3122 128.5444 129.9185 131.1763 131.5364 133.3327 136.1607 139.3660 139.5287 142.1128 142.2855 144.2766 145.9119 147.9956 148.6026 148.9569 149.4647 151.9550 152.8168 154.7335 155.1963 157.2428 157.7139 169.6438 170.3403 180.4470 185.6149 186.1444 186.4938 187.0246 188.6568 188.7980 190.3475 192.6909 196.7188 205.6941 243.3075 245.0928 247.2309 254.8441 257.3504 259.8181 550.4271 556.7183 614.3610 646.7699 897.9461 electronvolt
chargesum: -0.0000000
charge: -0.097011 -0.429710 -0.092145 -0.134885 0.091574 0.172939 0.120066 0.102690 0.120065 0.146415
qa: -0.0970 -0.4297 -0.0921 -0.1349 0.0916 0.1729 0.1201 0.1027 0.1201 0.1464
va: 2.2712 2.0048 3.2762 3.8392 4.3522 1.0004 0.9926 1.0348 0.9926 1.0247
dispcorr: -0.001870179 hartree
energy: -930.402018614576
dipole: 5.53993 -5.21793 0.32200 -4.17308 2.05377 -2.11930 0.00065 -0.00061 0.00004
magnitude: 2.14363 au
magnitude: 5.44867 debye
