program: Orca
programVersion: 5.0.2
elementType: F F F F F F F O O N N N N C C C C C C C C C C C C C C C C C C C H H H H H H H H H H H H H H H
charge: 0
multiplicity: 1
keywords: wb97x-d3
keywords: def2-TZVPP
keywords: def2/J RIJCOSX
keywords: DEFGRID2
keywords: scfconv7
keywords: smallprint printgap noloewdin
keywords: NOSOSCF
formula: C19H15F7N4O2
InChI: InChI=1/C19H15F7N4O2/c1-11(31)30-15-5-4-14(17(20,18(21,22)23)19(24,25)26)7-13(15)10-29(16(30)32)28-9-12-3-2-6-27-8-12/h2-8,28H,9-10H2,1H3
47 atoms
F  3.013524 -0.500468 -1.76758
F  4.919831 1.391011 -1.268564
F  3.565358 2.463529 0.016132
F  3.060384 2.140031 -2.047118
F  4.732812 -1.084585 0.032382
F  2.8072 -1.532155 0.869959
F  3.899336 0.202089 1.534979
O  -4.450531 -0.153883 0.443791
O  -2.330688 3.350228 1.050853
N  -3.029833 -0.35808 -1.310837
N  -2.629285 1.259376 0.277912
N  -3.599336 -1.532574 -1.78861
N  -3.124892 -3.03415 2.378915
C  -0.827094 0.550137 -1.108095
C  -1.921694 0.207227 -2.067136
C  -1.233149 1.070801 0.107922
C  1.448631 0.547585 -0.346294
C  2.905255 0.274958 -0.639947
C  0.512009 0.289815 -1.339407
C  -0.311724 1.304352 1.116471
C  1.027668 1.050176 0.882623
C  -3.456376 0.197786 -0.165479
C  3.635962 1.59041 -0.982625
C  3.603221 -0.544177 0.472891
C  -3.1145 2.474745 0.748046
C  -2.862342 -2.728714 -1.363482
C  -2.468916 -2.752736 0.085942
C  -4.596078 2.676356 0.830499
C  -1.188432 -2.404479 0.493074
C  -3.391128 -3.063521 1.080376
C  -0.894546 -2.359172 1.847975
C  -1.896926 -2.675775 2.747563
H  -2.251231 1.087521 -2.627312
H  -1.588084 -0.532986 -2.790608
H  0.797201 -0.128829 -2.29457
H  -0.620044 1.654945 2.090128
H  1.718051 1.241592 1.690871
H  -4.559335 -1.568926 -1.468254
H  -1.968016 -2.819761 -1.98255
H  -3.502655 -3.575407 -1.611137
H  -4.781864 3.731773 1.013351
H  -5.020638 2.104267 1.654041
H  -5.111148 2.384436 -0.083412
H  -0.425278 -2.177839 -0.241723
H  -4.399621 -3.355088 0.803715
H  0.091796 -2.08571 2.197551
H  -1.701901 -2.647045 3.81316
elementType: F O N C H
totalener: -1801.67335156 hartree
nucrepener: 3641.47364591 hartree
electener: -5443.14699747 hartree
oneelecener: -9722.01008822 hartree
twoeener: 4278.86309075 hartree
cpcmener: -0.04874747 hartree
kineticenergy: 1795.02966310 hartree
xcener: -158.798443528906 hartree
chargesum: -0.0000000
charge: -0.199007 -0.157678 -0.155825 -0.157325 -0.154154 -0.153924 -0.157208 -0.508914 -0.487986 0.028196 -0.055496 -0.220365 -0.367145 -0.095734 -0.053681 0.183110 0.006092 0.199275 -0.147829 -0.258174 -0.120037 0.290636 0.465850 0.480568 0.372290 -0.037787 0.013776 -0.249547 -0.133188 -0.029832 -0.177045 0.017162 0.129558 0.124544 0.134315 0.152353 0.150851 0.158202 0.109143 0.121658 0.100405 0.115779 0.121059 0.164937 0.135109 0.155356 0.147656
qa: -0.1990 -0.1577 -0.1558 -0.1573 -0.1542 -0.1539 -0.1572 -0.5089 -0.4880 0.0282 -0.0555 -0.2204 -0.3671 -0.0957 -0.0537 0.1831 0.0061 0.1993 -0.1478 -0.2582 -0.1200 0.2906 0.4658 0.4806 0.3723 -0.0378 0.0138 -0.2495 -0.1332 -0.0298 -0.1770 0.0172 0.1296 0.1245 0.1343 0.1524 0.1509 0.1582 0.1091 0.1217 0.1004 0.1158 0.1211 0.1649 0.1351 0.1554 0.1477
va: 1.0994 1.1636 1.1625 1.1620 1.1681 1.1568 1.1582 1.9864 2.0051 3.1427 3.0952 2.8941 3.0660 3.8073 3.9089 3.6266 3.5829 4.0397 3.9453 4.0499 3.9818 4.3992 4.4799 4.4705 4.0272 3.9163 3.5175 3.8955 3.9097 4.0679 3.8890 4.0103 0.9907 1.0050 1.0260 1.0156 1.0162 1.0299 0.9978 1.0029 1.0192 1.0113 1.0018 0.9818 1.0136 0.9963 0.9998
dispcorr: -0.031179171 hartree
energy: -1801.704530734271
dipole: -55.48428 55.63412 0.14984 -9.09946 8.26852 -0.83094 2.66283 -4.73123 -2.06840
magnitude: 2.23410 au
magnitude: 5.67863 debye
