program: Orca
programVersion: 5.0.2
elementType: F F F F F F F O O N N N N C C C C C C C C C C C C C C C C C C C H H H H H H H H H H H H H H H
charge: 0
multiplicity: 1
keywords: wb97x-d3
keywords: def2-TZVPP
keywords: def2/J RIJCOSX
keywords: DEFGRID2
keywords: scfconv7
keywords: smallprint printgap noloewdin
keywords: NOSOSCF
formula: C19H15F7N4O2
InChI: InChI=1/C19H15F7N4O2/c1-11(31)30-15-5-4-14(17(20,18(21,22)23)19(24,25)26)7-13(15)10-29(16(30)32)28-9-12-3-2-6-27-8-12/h2-8,28H,9-10H2,1H3
47 atoms
F  3.560748 0.267696 -1.591181
F  3.457269 2.800532 -0.865847
F  5.068494 1.790066 0.126899
F  3.297822 2.327349 1.227819
F  3.394674 -0.399485 1.834474
F  4.801452 -0.953389 0.310243
F  2.79568 -1.71559 0.235429
O  -4.337251 -0.334349 0.018704
O  -2.583605 2.820692 -1.967725
N  -2.653383 0.003122 1.498963
N  -2.599192 1.082085 -0.538178
N  -3.074768 -0.970522 2.396482
N  -3.810312 -3.810054 -0.931821
C  -0.569035 0.848614 0.686484
C  -1.480736 0.780721 1.867699
C  -1.182794 0.983179 -0.548588
C  1.573417 0.696466 -0.385523
C  3.07799 0.549933 -0.337263
C  0.802643 0.706174 0.773016
C  -0.428129 0.945779 -1.710247
C  0.948015 0.812583 -1.622205
C  -3.28339 0.19023 0.327378
C  3.743827 1.887138 0.055802
C  3.529223 -0.647207 0.532995
C  -3.238181 2.085717 -1.259417
C  -2.396683 -2.253865 2.179027
C  -2.479596 -2.759031 0.769009
C  -4.718122 2.254415 -1.101548
C  -1.495883 -2.473682 -0.168299
C  -3.609312 -3.438737 0.324387
C  -1.699403 -2.837977 -1.491436
C  -2.871932 -3.494581 -1.821653
H  -0.995246 0.28691 2.705965
H  -1.773183 1.780887 2.20177
H  1.232755 0.592883 1.757918
H  -0.891176 0.995647 -2.684059
H  1.514811 0.785764 -2.540968
H  -4.078521 -1.075232 2.306715
H  -2.852434 -2.957166 2.876102
H  -1.353026 -2.14198 2.477832
H  -4.99448 3.210582 -1.537997
H  -5.036281 2.240116 -0.060847
H  -5.256795 1.469636 -1.629254
H  -0.581429 -1.97241 0.128794
H  -4.393974 -3.690144 1.03145
H  -0.963693 -2.617274 -2.252595
H  -3.059949 -3.790966 -2.846968
elementType: F O N C H
totalener: -1801.67422287 hartree
nucrepener: 3619.47182997 hartree
electener: -5421.14605284 hartree
oneelecener: -9677.87966387 hartree
twoeener: 4256.73361104 hartree
cpcmener: -0.04910125 hartree
kineticenergy: 1795.02429194 hartree
xcener: -158.796984227029 hartree
chargesum: -0.0000000
charge: -0.196900 -0.157594 -0.157496 -0.156269 -0.157792 -0.153818 -0.155066 -0.500975 -0.487165 0.036902 -0.036719 -0.201042 -0.366363 -0.120313 -0.043789 0.157694 -0.030990 0.197620 -0.093070 -0.266102 -0.096566 0.246258 0.467776 0.479252 0.372310 -0.052813 0.000560 -0.249542 -0.103910 -0.034726 -0.164240 0.008947 0.120124 0.127209 0.142116 0.149687 0.146992 0.154499 0.120368 0.112105 0.101699 0.120613 0.115629 0.168919 0.133816 0.154862 0.147302
qa: -0.1969 -0.1576 -0.1575 -0.1563 -0.1578 -0.1538 -0.1551 -0.5010 -0.4872 0.0369 -0.0367 -0.2010 -0.3664 -0.1203 -0.0438 0.1577 -0.0310 0.1976 -0.0931 -0.2661 -0.0966 0.2463 0.4678 0.4793 0.3723 -0.0528 0.0006 -0.2495 -0.1039 -0.0347 -0.1642 0.0089 0.1201 0.1272 0.1421 0.1497 0.1470 0.1545 0.1204 0.1121 0.1017 0.1206 0.1156 0.1689 0.1338 0.1549 0.1473
va: 1.1012 1.1620 1.1632 1.1615 1.1567 1.1688 1.1574 1.9906 2.0047 3.1468 3.0807 2.8995 3.0606 3.8869 3.8965 3.6318 3.6418 4.0522 3.9740 4.0309 3.9886 4.4405 4.4767 4.4718 4.0244 3.9573 3.5114 3.8965 3.8826 4.0853 3.9055 4.0083 1.0094 0.9915 1.0257 1.0190 1.0128 1.0309 1.0053 0.9992 1.0185 1.0021 1.0116 0.9779 1.0108 0.9942 0.9994
dispcorr: -0.030344343 hartree
energy: -1801.704567212436
dipole: -55.97238 56.50915 0.53677 -10.21064 10.16255 -0.04809 0.71654 1.45339 2.16992
magnitude: 2.23585 au
magnitude: 5.68307 debye
