program: Orca
programVersion: 5.0.2
elementType: F F F F F F F O O N N N N C C C C C C C C C C C C C C C C C C C H H H H H H H H H H H H H H H
charge: 0
multiplicity: 1
keywords: wb97x-d3
keywords: def2-TZVPP
keywords: def2/J RIJCOSX
keywords: DEFGRID2
keywords: scfconv7
keywords: smallprint printgap noloewdin
keywords: NOSOSCF
formula: C19H15F7N4O2
InChI: InChI=1/C19H15F7N4O2/c1-11(31)30-15-5-4-14(17(20,18(21,22)23)19(24,25)26)7-13(15)10-29(16(30)32)28-9-12-3-2-6-27-8-12/h2-8,28H,9-10H2,1H3
47 atoms
F  3.104279 0.119751 -2.017405
F  3.2540 2.742627 -1.070071
F  5.009932 1.511279 -0.98185
F  3.940733 1.972977 0.822164
F  2.625832 -1.841411 -0.281044
F  3.166457 -0.622269 1.406335
F  4.630213 -1.089264 -0.100184
O  -4.378083 -0.304714 0.415772
O  -2.561149 3.410936 0.682996
N  -2.960206 -0.530691 -1.339622
N  -2.683592 1.238566 0.108588
N  -3.410528 -1.792353 -1.7064
N  -3.037529 -2.949181 2.573234
C  -0.832472 0.546342 -1.219717
C  -1.902601 0.063605 -2.144297
C  -1.27595 1.139352 -0.050214
C  1.436179 0.732255 -0.459274
C  2.902635 0.44931 -0.699426
C  0.519507 0.338451 -1.426336
C  -0.373525 1.513904 0.93259
C  0.979529 1.309589 0.724516
C  -3.422806 0.077655 -0.234591
C  3.797801 1.689052 -0.470061
C  3.349672 -0.793168 0.101631
C  -3.268155 2.448906 0.465394
C  -2.57738 -2.869023 -1.15951
C  -2.269367 -2.751587 0.306298
C  -4.761983 2.530965 0.53679
C  -1.067959 -2.22256 0.757127
C  -3.210693 -3.10452 1.268461
C  -0.872563 -2.044423 2.11905
C  -1.888141 -2.415316 2.982168
H  -2.299801 0.881368 -2.753008
H  -1.522701 -0.694259 -2.824636
H  0.83222 -0.145725 -2.340947
H  -0.707514 1.931045 1.871041
H  1.652572 1.6020 1.51675
H  -4.372038 -1.888343 -1.402608
H  -1.645271 -2.90304 -1.726592
H  -3.110524 -3.79532 -1.374359
H  -5.249936 2.111878 -0.341912
H  -5.039006 3.578445 0.622685
H  -5.136112 2.003679 1.412969
H  -0.288324 -1.95713 0.053454
H  -4.157491 -3.535894 0.958288
H  0.048917 -1.625639 2.50062
H  -1.770046 -2.285087 4.051456
elementType: F O N C H
totalener: -1801.67352519 hartree
nucrepener: 3651.19838940 hartree
electener: -5452.87191459 hartree
oneelecener: -9741.33815194 hartree
twoeener: 4288.46623735 hartree
cpcmener: -0.04910352 hartree
kineticenergy: 1795.01700968 hartree
xcener: -158.795893573802 hartree
chargesum: -0.0000000
charge: -0.199611 -0.156527 -0.155376 -0.156988 -0.158432 -0.159127 -0.156364 -0.504475 -0.489008 0.033350 -0.048435 -0.217238 -0.367283 -0.095633 -0.048443 0.176714 -0.000135 0.213541 -0.151412 -0.264902 -0.114171 0.274094 0.487000 0.462954 0.373064 -0.044735 0.017274 -0.250828 -0.128060 -0.033683 -0.182626 0.018525 0.129499 0.122829 0.134473 0.152140 0.151312 0.157302 0.110468 0.121076 0.121100 0.101157 0.115452 0.173353 0.135915 0.153387 0.147516
qa: -0.1996 -0.1565 -0.1554 -0.1570 -0.1584 -0.1591 -0.1564 -0.5045 -0.4890 0.0333 -0.0484 -0.2172 -0.3673 -0.0956 -0.0484 0.1767 -0.0001 0.2135 -0.1514 -0.2649 -0.1142 0.2741 0.4870 0.4630 0.3731 -0.0447 0.0173 -0.2508 -0.1281 -0.0337 -0.1826 0.0185 0.1295 0.1228 0.1345 0.1521 0.1513 0.1573 0.1105 0.1211 0.1211 0.1012 0.1155 0.1734 0.1359 0.1534 0.1475
va: 1.0997 1.1591 1.1675 1.1591 1.1561 1.1560 1.1662 1.9896 2.0044 3.1383 3.0875 2.8971 3.0641 3.8072 3.9047 3.6349 3.5813 4.0355 3.9638 4.0646 3.9854 4.4173 4.4801 4.4758 4.0270 3.9300 3.5104 3.8968 3.8978 4.0736 3.8971 4.0085 0.9908 1.0074 1.0268 1.0158 1.0160 1.0296 0.9981 1.0036 1.0018 1.0190 1.0114 0.9679 1.0120 0.9964 0.9997
dispcorr: -0.031449948 hartree
energy: -1801.704975134052
dipole: -54.72345 54.97336 0.24992 -8.85676 7.96907 -0.88769 2.30744 -4.26280 -1.95536
magnitude: 2.16192 au
magnitude: 5.49515 debye
