program: Orca
programVersion: 5.0.2
elementType: F F F F F F F O O N N N N C C C C C C C C C C C C C C C C C C C H H H H H H H H H H H H H H H
charge: 0
multiplicity: 1
keywords: wb97x-d3
keywords: def2-TZVPP
keywords: def2/J RIJCOSX
keywords: DEFGRID2
keywords: scfconv7
keywords: smallprint printgap noloewdin
keywords: NOSOSCF
formula: C19H15F7N4O2
InChI: InChI=1/C19H15F7N4O2/c1-11(31)30-15-5-4-14(17(20,18(21,22)23)19(24,25)26)7-13(15)10-29(16(30)32)28-9-12-3-2-6-27-8-12/h2-8,28H,9-10H2,1H3
47 atoms
F  2.722368 -1.218506 -0.795799
F  3.295132 2.238979 -0.741917
F  2.88012 0.887474 -2.364955
F  4.717096 0.711206 -1.268678
F  4.555891 -0.906483 0.948172
F  2.704548 -0.817859 2.022407
F  3.833037 0.986071 1.664155
O  -4.734127 0.40701 0.565147
O  -2.360508 3.777115 0.539296
N  -3.280574 -0.310957 -1.016401
N  -2.781595 1.587947 0.205675
N  -3.955386 -1.493185 -1.2819
N  -0.624863 -2.379308 1.717286
C  -1.000172 0.407422 -0.850585
C  -2.07349 -0.045622 -1.784055
C  -1.400365 1.260057 0.165897
C  1.25388 0.458391 -0.019826
C  2.689589 0.015164 -0.191311
C  0.316275 -0.005167 -0.937555
C  -0.481499 1.704097 1.104122
C  0.844819 1.320051 0.993633
C  -3.692975 0.527536 -0.050404
C  3.418811 0.981439 -1.153874
C  3.460888 -0.179378 1.136114
C  -3.190227 2.910312 0.361697
C  -3.846094 -2.480956 -0.205951
C  -2.411001 -2.72378 0.148081
C  -4.652025 3.227918 0.266362
C  -1.543972 -3.409194 -0.695061
C  -1.887314 -2.225142 1.333072
C  -0.222112 -3.566134 -0.316149
C  0.187956 -3.03338 0.89696
H  -2.264585 0.713015 -2.549805
H  -1.792696 -0.961101 -2.295924
H  0.587769 -0.687226 -1.731577
H  -0.778046 2.330712 1.931222
H  1.532245 1.70632 1.731714
H  -4.929765 -1.288258 -1.471031
H  -4.305591 -3.394087 -0.585973
H  -4.398447 -2.197858 0.694075
H  -5.124767 2.777866 -0.604368
H  -4.755766 4.307225 0.199865
H  -5.184563 2.887629 1.152476
H  -1.899459 -3.817436 -1.633009
H  -2.533229 -1.679061 2.013605
H  0.482661 -4.093748 -0.943882
H  1.214372 -3.15231 1.221954
elementType: F O N C H
totalener: -1801.67471542 hartree
nucrepener: 3679.84671783 hartree
electener: -5481.52143325 hartree
oneelecener: -9800.22260863 hartree
twoeener: 4318.70117538 hartree
cpcmener: -0.04471420 hartree
kineticenergy: 1795.02296597 hartree
xcener: -158.797473367881 hartree
chargesum: 0.0000000
charge: -0.201092 -0.155861 -0.157914 -0.158372 -0.155965 -0.156200 -0.158614 -0.498308 -0.486087 0.016613 -0.063963 -0.221824 -0.363175 -0.053038 -0.072147 0.123055 -0.027399 0.205852 -0.164442 -0.211278 -0.116566 0.318111 0.473952 0.491446 0.372886 -0.042514 0.049615 -0.250214 -0.188490 -0.028517 -0.125601 0.008394 0.130371 0.123464 0.141611 0.154552 0.146282 0.152572 0.116272 0.120703 0.121400 0.100576 0.115739 0.151412 0.127160 0.156262 0.139278
qa: -0.2011 -0.1559 -0.1579 -0.1584 -0.1560 -0.1562 -0.1586 -0.4983 -0.4861 0.0166 -0.0640 -0.2218 -0.3632 -0.0530 -0.0721 0.1231 -0.0274 0.2059 -0.1644 -0.2113 -0.1166 0.3181 0.4740 0.4914 0.3729 -0.0425 0.0496 -0.2502 -0.1885 -0.0285 -0.1256 0.0084 0.1304 0.1235 0.1416 0.1546 0.1463 0.1526 0.1163 0.1207 0.1214 0.1006 0.1157 0.1514 0.1272 0.1563 0.1393
va: 1.0943 1.1614 1.1641 1.1606 1.1668 1.1547 1.1585 2.0065 2.0048 3.1493 3.0995 2.8826 3.0259 3.8260 3.9190 3.7441 3.6383 4.0189 3.9391 4.0557 4.0044 4.3789 4.4883 4.4661 4.0266 3.8460 3.5221 3.8955 3.9640 4.0470 3.8474 3.9652 0.9935 1.0101 1.0257 1.0152 1.0200 1.0216 1.0063 1.0066 1.0012 1.0188 1.0118 1.0064 1.0187 0.9915 1.0120
dispcorr: -0.032135933 hartree
energy: -1801.706851356143
dipole: -55.11982 53.60510 -1.51473 -7.86144 6.22060 -1.64084 -2.21036 0.00131 -2.20904
magnitude: 3.14112 au
magnitude: 7.98409 debye
