program: Orca
programVersion: 5.0.2
elementType: F F F F F F F O O N N N N C C C C C C C C C C C C C C C C C C C H H H H H H H H H H H H H H H
charge: 0
multiplicity: 1
keywords: wb97x-d3
keywords: def2-TZVPP
keywords: def2/J RIJCOSX
keywords: DEFGRID2
keywords: scfconv7
keywords: smallprint printgap noloewdin
keywords: NOSOSCF
formula: C19H15F7N4O2
InChI: InChI=1/C19H15F7N4O2/c1-11(31)30-15-5-4-14(17(20,18(21,22)23)19(24,25)26)7-13(15)10-29(16(30)32)28-9-12-3-2-6-27-8-12/h2-8,28H,9-10H2,1H3
47 atoms
F  3.483374 -0.591732 -1.025291
F  3.184465 1.738514 -2.566889
F  5.134085 1.179584 -1.873297
F  4.116498 2.840073 -0.96338
F  5.311079 0.478647 0.78232
F  3.540551 -0.430588 1.585062
F  3.747239 1.711989 1.597708
O  -4.180608 0.95985 -1.048241
O  -2.137914 2.757582 2.025376
N  -2.613311 -0.660765 -0.835171
N  -2.333677 1.345821 0.279868
N  -3.221622 -1.518011 -1.739392
N  -2.660529 -5.065516 0.544112
C  -0.415358 -0.009726 -0.130184
C  -1.403759 -1.127779 -0.176094
C  -0.927463 1.255849 0.107712
C  1.802237 0.899199 -0.295065
C  3.283401 0.652654 -0.478028
C  0.941004 -0.189458 -0.335945
C  -0.080365 2.355246 0.117818
C  1.279163 2.170336 -0.068899
C  -3.140576 0.549749 -0.576211
C  3.945598 1.62577 -1.483545
C  3.992098 0.611588 0.894836
C  -2.872696 2.108941 1.314871
C  -4.381593 -2.213362 -1.188858
C  -3.954155 -3.14688 -0.094359
C  -4.355008 2.070767 1.54781
C  -4.316487 -2.946282 1.229071
C  -3.120975 -4.227985 -0.372463
C  -3.844604 -3.818503 2.200133
C  -3.01754 -4.856851 1.808101
H  -1.020833 -1.968182 -0.749311
H  -1.626969 -1.487297 0.833996
H  1.301301 -1.191292 -0.524461
H  -0.455814 3.357738 0.252984
H  1.90348 3.051431 -0.04268
H  -3.474563 -0.999547 -2.573124
H  -4.816715 -2.773875 -2.019004
H  -5.15733 -1.535203 -0.818677
H  -4.758912 1.059126 1.564387
H  -4.889032 2.631879 0.782613
H  -4.549698 2.53639 2.511352
H  -4.958313 -2.116051 1.500236
H  -2.811144 -4.417096 -1.39605
H  -4.106244 -3.693294 3.24216
H  -2.626949 -5.551238 2.543759
elementType: F O N C H
totalener: -1801.68055197 hartree
nucrepener: 3476.57508407 hartree
electener: -5278.25563603 hartree
oneelecener: -9392.59921135 hartree
twoeener: 4114.34357532 hartree
cpcmener: -0.03582306 hartree
kineticenergy: 1795.00391164 hartree
xcener: -158.788705374016 hartree
chargesum: -0.0000000
charge: -0.198000 -0.155374 -0.153739 -0.157624 -0.156919 -0.157418 -0.155108 -0.474596 -0.456547 0.001829 -0.084581 -0.207367 -0.362493 -0.056665 -0.051527 0.109053 -0.038299 0.183452 -0.110995 -0.200722 -0.125918 0.339118 0.485643 0.464497 0.351849 -0.059556 0.024015 -0.245811 -0.167183 -0.005053 -0.134210 0.006552 0.113412 0.117959 0.137298 0.151225 0.150476 0.145339 0.118584 0.109132 0.113586 0.116120 0.102060 0.147867 0.126676 0.155562 0.144402
qa: -0.1980 -0.1554 -0.1537 -0.1576 -0.1569 -0.1574 -0.1551 -0.4746 -0.4565 0.0018 -0.0846 -0.2074 -0.3625 -0.0567 -0.0515 0.1091 -0.0383 0.1835 -0.1110 -0.2007 -0.1259 0.3391 0.4856 0.4645 0.3518 -0.0596 0.0240 -0.2458 -0.1672 -0.0051 -0.1342 0.0066 0.1134 0.1180 0.1373 0.1512 0.1505 0.1453 0.1186 0.1091 0.1136 0.1161 0.1021 0.1479 0.1267 0.1556 0.1444
va: 1.0994 1.1602 1.1688 1.1581 1.1627 1.1635 1.1622 2.0392 2.0375 3.1421 3.1250 2.8852 3.0725 3.9114 3.8940 3.7962 3.6945 4.0425 3.9974 4.0520 4.0276 4.3582 4.4768 4.4786 4.0579 3.9116 3.5496 3.8921 3.9444 4.0437 3.8958 4.0036 1.0160 0.9817 1.0262 1.0179 1.0162 1.0270 1.0049 1.0082 1.0020 1.0125 1.0187 1.0024 1.0226 0.9914 0.9992
dispcorr: -0.026808630 hartree
energy: -1801.707360597064
dipole: -66.01268 64.20565 -1.80703 -18.62130 17.99166 -0.62964 7.11700 -7.18934 -0.07234
magnitude: 1.91495 au
magnitude: 4.86742 debye
